Vocabolario delle cause innescanti i sinkhole.
type: ConceptScheme
type: Dataset
type: Asset
title: Vocabulary about sinkhole trigger causes. @en
description: The terms classify the possible causes of sinkhole triggering. @en
description: I termini classificano le possibile cause di innesco dei sinkhole.
issued: 2024-10-01
modified: 2024-10-01
creator: ISPRA08
rights holder: Istituto Superiore per la Protezione e la Ricerca Ambientale
version info: 1.0
language: ITA
language: ENG
theme: ge
theme: nz
keyword: Geologia
keyword: GeoSciencesIR @en
keyword: Gestione del territorio
keyword: Geomorfologia
keyword: Cartografia
keyword: Geomorphology @en
keyword: Collapse @en
accrual periodicity: IRREG
distribution: sinkholes-triggerCauses-RDF-TURTLE
type: Codelist
contact point: ISPRA08
number of levels: 1
key concept: triggerCauses
conforms to: SKOS
representation technique: SKOS
creator: Stefania Nisio (ORCID: 0000-0002-5422-3694)
creator: Giuseppe Delmonaco (ORCID: 0000-0002-4719-8857)
creator: Giuseppe Castorina (ORCID: 0000-0003-1646-3010)
creator: Maria Pia Congi (ORCID: 0000-0002-9330-9554)
creator: Carlo Cipolloni (ORCID: 0000-0001-7652-9814)
creator: Elio Giulianelli (ORCID: 0000-0003-0998-9751)
comment: Classificazione funzionale al database nazionale dei Sinkhole naturali prodotto da ISPRA e armonizzato per il progetto PNRR GeoSciences IR.
comment: This classification supports the ISPRA National Natural Sinkhole Database, harmonized in accordance with the PNRR GeoSciences IR project standards. @en
publisher: Istituto Superiore per la Protezione e la Ricerca Ambientale
has top concept: Inondazione
has top concept: Alternanza di inondazioni ed eventi di siccità
has top concept: variazione piezometrica rapida
has top concept: terremoto
has top concept: Estrazione mineraria
has top concept: Estrazione mineraria in sotterraneo
has top concept: Attività agricole
has top concept: Vibrazioni

Istituto Superiore per la Protezione e la Ricerca Ambientale
type: NamedIndividual
type: Agent
type: Organization
type: Organosation
fn: Istituto Superiore per la Protezione e la Ricerca Ambientale

Distribuzione RDF/Turtle del vocabolario controllato GeoSciencesIR per le cause d'innesco dei sinkhole.
type: Distribution
format: RDF TURTLE
license: A21 CCBY40
title: RDF/Turtle distribution of the GeoSciencesIR controlled vocabulary for sinkhole triggering causes. @en
description: Questa è la Distribuzione RDF/Turtle del vocabolario controllato GeoSciencesIR per le cause d'innesco dei sinkhole.
description: This is the RDF/Turtle distribution of the GeoSciencesIR controlled vocabulary for sinkhole triggering causes. @en
access URL: https://github.com/isprambiente/dati-semantic/tree/main/assets/controlled-vocabularies/sinkholes/triggerCauses
download URL: https://raw.githubusercontent.com/isprambiente/dati-semantic/main/assets/controlled-vocabularies/sinkholes/triggerCauses/triggerCauses.ttl

ISPRA08
type: NamedIndividual
type: Organization
type: Kind
fn: Unità ISPRA 08 del progetto GeoSciencesIR (Research Infrastructure)
fn: GeoSciencesIR (Research Infrastructure) project Unit ISPRA 08 @en

Inondazione
type: Concept
definition: Processes of inundation of usually dry (emerged) land, or temporary covering by water of land not normally covered by water. @en
definition: Processi di inondazione di terreni generalmente asciutti (emersi) con grandi volumi i di acque provenienti da corsi d’acqua o sal ruscellamento superficiale.
preferred label: Floods @en
notation: 1
top concept of: Vocabolario delle cause innescanti i sinkhole.
in scheme: Vocabolario delle cause innescanti i sinkhole.

Alternanza di inondazioni ed eventi di siccità
type: Concept
definition: Sustained and extensive occurrence of below-average water availability, caused by climate variability @en
definition: Presenza prolungata e diffusa di disponibilità d'acqua al di sotto della media, causata dalla variabilità del clima
preferred label: Alternance of floods and drought events @en
notation: 2
top concept of: Vocabolario delle cause innescanti i sinkhole.
in scheme: Vocabolario delle cause innescanti i sinkhole.

variazione piezometrica rapida
type: Concept
definition: Variation of the groundwater level in the soil @en
definition: Rapida oscillazione del livello della falda nel sottosuolo
preferred label: Rapid piezometric variation @en
notation: 3
top concept of: Vocabolario delle cause innescanti i sinkhole.
in scheme: Vocabolario delle cause innescanti i sinkhole.

terremoto
type: Concept
definition: Earthquake hazards involve the propagation of elastic waves at or near the surface after the release of tectonic stress or other natural sources, such as volcanic explosions or meteorite impacts. @en
definition: Un evento sismico comporta la propagazione di onde elastiche sulla superficie in prossimità del suolo dopo il rilascio di stress tettonico o di altre sorgenti naturali, quali esplosioni vulcaniche o impatti meteorici.
preferred label: Earthquake @en
notation: 4
top concept of: Vocabolario delle cause innescanti i sinkhole.
in scheme: Vocabolario delle cause innescanti i sinkhole.

Estrazione mineraria
type: Concept
definition: Broad category of mining in which soil and rock overlying the mineral deposit (the overburden) are removed. @en
definition: Ampia categoria di attività minerarie in cui vengono rimossi il suolo e la roccia che sovrastano il giacimento minerario (il deposito superficiale)
preferred label: Surface mining @en
notation: 5
top concept of: Vocabolario delle cause innescanti i sinkhole.
in scheme: Vocabolario delle cause innescanti i sinkhole.

Estrazione mineraria in sotterraneo
type: Concept
definition: An underground excavation for the extraction of mineral deposits, in contrast to surface excavations @en
definition: Scavo sotterraneo per l’estrazione di giacimenti minerali.
preferred label: Underground mining @en
notation: 6
top concept of: Vocabolario delle cause innescanti i sinkhole.
in scheme: Vocabolario delle cause innescanti i sinkhole.

Attività agricole
type: Concept
definition: Rearing of animals and/or cultivation of plants @en
definition: Allevamento di animali e/o coltivazione di piante
preferred label: Agricultural activities @en
notation: 7
top concept of: Vocabolario delle cause innescanti i sinkhole.
in scheme: Vocabolario delle cause innescanti i sinkhole.

Vibrazioni
type: Concept
definition: This class includes the installation of equipment other than electrical, plumbing, heating and air-conditioning systems or industrial machinery in buildings and civil engineering structures.This class includes:- installation in buildings or other construction projects of: • elevators, escalators, including repair and maintenance • automated and revolving doors • lightning conductors • vacuum cleaning systems • thermal, sound or vibration insulation @en
definition: Questa classe comprende l'installazione di apparecchiature diverse da quelle elettriche, idrauliche, di riscaldamento e condizionamento d'aria o di macchine industriali in edifici e strutture di ingegneria civile. Questa classe comprende:- installazione in edifici o altri progetti di costruzione di: • ascensori, scale mobili, comprese le riparazioni e la manutenzione • porte automatiche e rotanti • parafulmini • sistemi di aspirazione • isolamento termico, acustico o dalle vibrazioni
preferred label: Vibrations @en
notation: 8
top concept of: Vocabolario delle cause innescanti i sinkhole.
in scheme: Vocabolario delle cause innescanti i sinkhole.