Vocabolario delle cause precursori dei sonkhole.
type: ConceptScheme
type: Dataset
type: Asset
title: Vocabulary of predisposing sinkhole causes. @en
description: The terms identify the classes of precursors that cause sinkholes to occur. @en
description: I termini identificano le classi di precursori che sono causa di realizzazione dei sinkhole.
issued: 2024-10-01
modified: 2024-10-01
creator: ISPRA08
rights holder: Istituto Superiore per la Protezione e la Ricerca Ambientale
version info: 1.0
language: ITA
language: ENG
theme: ge
theme: nz
keyword: Geologia
keyword: GeoSciencesIR @en
keyword: Gestione del territorio
keyword: Dolina di sprofondamento
keyword: Geomorphology @en
keyword: Collapse @en
accrual periodicity: IREEG
distribution: sinkholes-predisposingCauses-RDF-TURTLE
type: CodeList
contact point: ISPRA08
number of levels: 1
key concept: predisposingCauses
conforms to: SKOS
representation technique: SKOS
creator: Stefania Nisio (ORCID: 0000-0002-5422-3694)
creator: Giuseppe Delmonaco (ORCID: 0000-0002-4719-8857)
creator: Giuseppe Castorina (ORCID: 0000-0003-1646-3010)
creator: Maria Pia Congi (ORCID: 0000-0002-9330-9554)
creator: Carlo Cipolloni (ORCID: 0000-0001-7652-9814)
creator: Elio Giulianelli (ORCID: 0000-0003-0998-9751)
comment: Il vocabolario è stato sviluppato nel progetto PNRR GeoSciences IR - per l'armonizzazione dei termini del database Sinkhole naturali.
comment: The vocabulary was developed within the PNRR GeoSciences IR project for the harmonization of terms in the Natural Sinkholes database. @en
publisher: Istituto Superiore per la Protezione e la Ricerca Ambientale
has top concept: Substrato
has top concept: Materiali alterati
has top concept: Materiali fratturati
has top concept: Frattura di faglia
has top concept: Falda acquifera sotto pressione
has top concept: presenza di fluidi endogeni

Istituto Superiore per la Protezione e la Ricerca Ambientale
type: NamedIndividual
type: Agent
type: Organization
type: Organisation
fn: Istituto Superiore per la Protezione e la Ricerca Ambientale

ISPRA08
type: NamedIndividual
type: Organization
type: Kind
fn: Unità ISPRA 08 del progetto GeoSciencesIR (Research Infrastructure)
fn: GeoSciencesIR (Research Infrastructure) project Unit ISPRA 08 @en

Distribuzione RDF/Turtle del vocabolario controllato GeoSciencesIR per le cause predisponenti dei sinkhole.
type: Distribution
format: RDF TURTLE
license: A21 CCBY40
title: RDF/Turtle distribution of the GeoSciencesIR controlled vocabulary for sinkhole predisposing causes. @en
description: Questa è la Distribuzione RDF/Turtle del vocabolario controllato GeoSciencesIR per le cause predisponenti dei sinkhole.
description: This is the RDF/Turtle distribution of the GeoSciencesIR controlled vocabulary for sinkhole predisposing causes. @en
access URL: https://github.com/isprambiente/dati-semantic/tree/main/assets/controlled-vocabularies/sinkholes/predisposingCauses
download URL: https://raw.githubusercontent.com/isprambiente/dati-semantic/main/assets/controlled-vocabularies/sinkholes/predisposingCauses/predisposingCauses.ttl

Substrato
type: Concept
definition: A karst aquifers is a rock volume (maily made of limestone and dolomite) with voids which contain large amount of water, prone to karst processes @en
definition: Un acquifero carsico è un volume di roccia ( per lo più costituita da calcari e dolomie) sottoposta a processi carsici unito a vuoti che imagazzinano grandi quantità di acqua.
preferred label: Karstable substrate @en
notation: 1
top concept of: Vocabolario delle cause precursori dei sonkhole.
in scheme: Vocabolario delle cause precursori dei sonkhole.

Materiali alterati
type: Concept
definition: Terrains and rocks characterised by alteration and disintegration @en
definition: Terreni e rocce che hanno subito alterazioni e disgregazioni.
preferred label: Altered materials @en
notation: 2
top concept of: Vocabolario delle cause precursori dei sonkhole.
in scheme: Vocabolario delle cause precursori dei sonkhole.

Materiali fratturati
type: Concept
definition: Rock terrains made of small fractured blocks @en
definition: Terreni rocciosi che hanno subito una fratturazione in piccoli blocchi
preferred label: Fractured materials @en
notation: 3
top concept of: Vocabolario delle cause precursori dei sonkhole.
in scheme: Vocabolario delle cause precursori dei sonkhole.

Frattura di faglia
type: Concept
definition: Fracture of the earth's crust with a displacement of one of the two parts along a plane surface @en
definition: Frattura della crosta terrestre, accompagnata da uno spostamento di una delle due parti lungo un piano
preferred label: Fault fracture @en
notation: 4
top concept of: Vocabolario delle cause precursori dei sonkhole.
in scheme: Vocabolario delle cause precursori dei sonkhole.

Falda acquifera sotto pressione
type: Concept
definition: Underground confined aquifer delimited both above and below by rocks or impermeable soil that prevent water filtration @en
definition: E' una falda confinata, presente nel sottosuolo, delimitata sia superiormente che inferiormente da rocce o terreni impermeabili che impediscono la filtrazione dell'acqua.
preferred label: Pressured aquifer @en
notation: 5
top concept of: Vocabolario delle cause precursori dei sonkhole.
in scheme: Vocabolario delle cause precursori dei sonkhole.

presenza di fluidi endogeni
type: Concept
definition: Presence of water and gas which derive by endogenous processes @en
definition: Presenza di acqua e gas derivanti dai processi endogeni
preferred label: Presence of endogenous fluids @en
notation: 6
top concept of: Vocabolario delle cause precursori dei sonkhole.
in scheme: Vocabolario delle cause precursori dei sonkhole.