Vocabolario dei fenomeni precursori al sinkhole.
type: ConceptScheme
type: Dataset
type: Asset
title: Vocabulary of sinkhole precursor phenomena. @en
description: The terms describe the classes of phenomena precursors to the triggering of the sinkhole. @en
description: I termini descrivono le classi di fenomeni precursori al innesco del sinkhole.
issued: 2024-10-01
modified: 2024-10-01
creator: ISPRA08
rights holder: Istituto Superiore per la Protezione e la Ricerca Ambientale
version info: 1.0
language: ITA
language: ENG
theme: ge
theme: nz
keyword: Geologia
keyword: GeoSciencesIR @en
keyword: Gestione del territorio
keyword: Dolina di sprofondamento
keyword: Geomorphology @en
keyword: Collapse @en
accrual periodicity: IRREG
distribution: sinkholes-precursorPhenomena-RDF-TURTLE
type: CodeList
contact point: ISPRA08
number of levels: 1
key concept: precursorPhenomena
conforms to: SKOS
representation technique: SKOS
creator: Stefania Nisio (ORCID: )
creator: Giuseppe Delmonaco (ORCID: 0000-0002-4719-8857)
creator: Giuseppe Castorina (ORCID: 0000-0003-1646-3010)
creator: Maria Pia Congi (ORCID: 0000-0002-9330-9554)
creator: Carlo Cipolloni (ORCID: 0000-0001-7652-9814)
creator: Elio Giulianelli (ORCID: 0000-0003-0998-9751)
comment: Classificazione funzionale al database nazionale dei Sinkhole naturali prodotto da ISPRA e armonizzato per il progetto PNRR GeoSciences IR.
comment: Classification functional to the National Database of Natural Sinkholes, produced by ISPRA and harmonized for the PNRR GeoSciences IR project. @en
publisher: Istituto Superiore per la Protezione e la Ricerca Ambientale
has top concept: Crollo di massi in sotterraneo
has top concept: Rigonfiamento
has top concept: Cedimento
has top concept: Evidenti rumori della struttura
has top concept: Pressione dell'acqua
has top concept: Pendenza dei pali e degli alberi
has top concept: Scomparsa d'acqua
has top concept: Fonti d'acqua
has top concept: Cambiamenti nei livelli dell'acqua
has top concept: Variazione delle sorgenti di portata
has top concept: Rumori sotterranei
has top concept: Danni agli artefatti
has top concept: Fratture di rottura

Istituto Superiore per la Protezione e la Ricerca Ambientale
type: NamedIndividual
type: Agent
type: Organization
type: Organisation
fn: Istituto Superiore per la Protezione e la Ricerca Ambientale

ISPRA08
type: NamedIndividual
type: Organization
type: Kind
fn: Unità ISPRA 08 del progetto GeoSciencesIR (Research Infrastructure)
fn: GeoSciencesIR (Research Infrastructure) project Unit ISPRA 08 @en

Distribuzione RDF/Turtle del vocabolario controllato GeoSciencesIR per i fenomeni precursori dei sinkhole.
type: Distribution
format: RDF TURTLE
license: A21 CCBY40
title: RDF/Turtle distribution of the GeoSciencesIR controlled vocabulary for sinkhole precursor phenomena. @en
description: Questa è la Distribuzione RDF/Turtle del vocabolario controllato GeoSciencesIR per i fenomeni precursori dei sinkhole.
description: This is the RDF/Turtle distribution of the GeoSciencesIR controlled vocabulary for sinkhole precursor phenomena. @en
access URL: https://github.com/isprambiente/dati-semantic/tree/main/assets/controlled-vocabularies/sinkholes/precursorPhenomena
download URL: https://raw.githubusercontent.com/isprambiente/dati-semantic/main/assets/controlled-vocabularies/sinkholes/precursorPhenomena/precursorPhenomena.ttl

Crollo di massi in sotterraneo
type: Concept
definition: General term to indicate the movement and downward transport of rock material due to rock mass fracture phenomena. @en
definition: Termine generale per indicare lo spostamento e il trasporto verso il basso di materiale roccioso per fenomeni di rottura dell’ammasso roccioso.
preferred label: Rockfall activity @en
notation: 1
top concept of: Vocabolario dei fenomeni precursori al sinkhole.
in scheme: Vocabolario dei fenomeni precursori al sinkhole.

Rigonfiamento
type: Concept
definition: Ground swelling due to increased pressure in the soil from below @en
definition: Il rigonfiamento del terreno è dovuto all'aumento della pressione nel suolo dal basso.
preferred label: Swelling @en
notation: 2
top concept of: Vocabolario dei fenomeni precursori al sinkhole.
in scheme: Vocabolario dei fenomeni precursori al sinkhole.

Cedimento
type: Concept
definition: Settlement of land or soil through compaction of loose or excavated material @en
definition: Cedimenti di terreni o suoli mediante compattazione di materiale sciolto o scavato
preferred label: Failure @en
notation: 3
top concept of: Vocabolario dei fenomeni precursori al sinkhole.
in scheme: Vocabolario dei fenomeni precursori al sinkhole.

Evidenti rumori della struttura
type: Concept
definition: Evidence of noises or creaking of the structure precursors to collapse. @en
definition: Evidenza di rumori o scricchiolii della struttura precursori del collasso
preferred label: Click noise structure @en
notation: 4
top concept of: Vocabolario dei fenomeni precursori al sinkhole.
in scheme: Vocabolario dei fenomeni precursori al sinkhole.

Pressione dell'acqua
type: Concept
definition: Variation in water pressure @en
definition: Variazioni di pressione d'acqua
preferred label: Water pressure @en
notation: 5
top concept of: Vocabolario dei fenomeni precursori al sinkhole.
in scheme: Vocabolario dei fenomeni precursori al sinkhole.

Pendenza dei pali e degli alberi
type: Concept
definition: Trees and poles that shift from the vertical @en
definition: Alberi e pali che si spostano dalla verticale
preferred label: Slope of pales and trees @en
notation: 6
top concept of: Vocabolario dei fenomeni precursori al sinkhole.
in scheme: Vocabolario dei fenomeni precursori al sinkhole.

Scomparsa d'acqua
type: Concept
definition: Extinction of water springs @en
definition: Estinzione delle sorgenti d'acqua
preferred label: Disappearance of Water @en
notation: 7
top concept of: Vocabolario dei fenomeni precursori al sinkhole.
in scheme: Vocabolario dei fenomeni precursori al sinkhole.

Fonti d'acqua
type: Concept
definition: Formation of springs that can emerge from soil or rocks @en
definition: Formazione di sorgenti che possono emergere dal terreno o dalle rocce
preferred label: Water sources @en
notation: 8
top concept of: Vocabolario dei fenomeni precursori al sinkhole.
in scheme: Vocabolario dei fenomeni precursori al sinkhole.

Cambiamenti nei livelli dell'acqua
type: Concept
definition: Variation in groundwater level in the soil and wells @en
definition: Variazione del livello delle acque sotterranee nel terreno e nei pozzi
preferred label: Changes in water levels @en
notation: 9
top concept of: Vocabolario dei fenomeni precursori al sinkhole.
in scheme: Vocabolario dei fenomeni precursori al sinkhole.

Variazione delle sorgenti di portata
type: Concept
definition: Variation in the flow rate of springs @en
definition: Variazione della portata delle sorgenti
preferred label: Variation of flow sources @en
notation: 10
top concept of: Vocabolario dei fenomeni precursori al sinkhole.
in scheme: Vocabolario dei fenomeni precursori al sinkhole.

Rumori sotterranei
type: Concept
definition: Underground vibrations and rumblings @en
definition: Vibrazioni e rumori sotterranei
preferred label: Underground noises @en
notation: 11
top concept of: Vocabolario dei fenomeni precursori al sinkhole.
in scheme: Vocabolario dei fenomeni precursori al sinkhole.

Danni agli artefatti
type: Concept
definition: Damage to buildings, such as subsidence and collapses @en
definition: Danni agli edifici, come cedimenti e crolli
preferred label: Damage to artifacts @en
notation: 12
top concept of: Vocabolario dei fenomeni precursori al sinkhole.
in scheme: Vocabolario dei fenomeni precursori al sinkhole.

Fratture di rottura
type: Concept
definition: Presence of cracks along building walls and on road or ground surfaces @en
definition: Presenza di crepe lungo le pareti degli edifici e sulle superfici stradali o del terreno
preferred label: Cracks Fractures @en
notation: 13
top concept of: Vocabolario dei fenomeni precursori al sinkhole.
in scheme: Vocabolario dei fenomeni precursori al sinkhole.