Vocabolario dei metodi di datazione.
type: ConceptScheme
type: Dataset
type: Asset
title: Vocabulary of dating methods. @en
description: Terms that describe the dating method for defining the age of seismic events @en
description: Termini che descrivono il metodo di datazione per definire l'età degli eventi sismici
issued: 2024-07-04
modified: 2024-07-04
creator: ISPRA12
rights holder: Istituto Superiore per la Protezione e la Ricerca Ambientale
version info: 1.0
language: ITA
language: ENG
theme: ge
theme: nz
keyword: Geologia strutturale
keyword: GeoSciencesIR @en
keyword: Tettonica
keyword: Cartografia
keyword: Geologia
keyword: Tectonics @en
accrual periodicity: IRREG
distribution: paleosites-datingMethods-RDF-TURTLE
type: Taxonomy
contact point: ISPRA12
number of levels: 2
key concept: datingMethods
conforms to: SKOS
representation technique: SKOS
creator: Annamaria Blumetti (ORCID: 0000-0002-5331-9379)
creator: Pio Di Manna (ORCID: 0000-0003-3486-5136)
creator: Valerio Comerci (ORCID: 0000-0002-1022-9488)
creator: Deborah Maceroni
creator: Livio Bonadeo
creator: Giuseppe Castorina (ORCID: 0000-0003-1646-3010)
creator: Maria Pia Congi (ORCID: 0000-0002-9330-9554)
creator: Carlo Cipolloni (ORCID: 0000-0001-7652-9814)
creator: Elio Giulianelli (ORCID: 0000-0003-0998-9751)
comment: Standardizzazione dei termini e dei parametri utilizzati nelle codelist durante il processo di implementazione del Catalogo ITHACA, il database delle faglie capaci e dei siti paleosismologici.
comment: Standardization of terms and parameters used in codelists during the implementation process of the ITHACA Catalogue, the database of capable faults and paleoseismological sites. @en
publisher: Istituto Superiore per la Protezione e la Ricerca Ambientale
has top concept: Tecnica di laboratorio
has top concept: Dato archeologico
has top concept: Considerazioni morfolitostratigrafiche
has top concept: Fagliazione superficiale e Radiocarbonio
has top concept: Dato archeologico e Radiocarbonio
has top concept: Radiocarbonio e considerazioni morfolitostratigrafiche
has top concept: Fagliazione superficiale

Istituto Superiore per la Protezione e la Ricerca Ambientale
type: NamedIndividual
type: Agent
type: Organization
type: Organosation
fn: Istituto Superiore per la Protezione e la Ricerca Ambientale

ISPRA12
type: NamedIndividual
type: Organization
type: Kind
fn: Unità ISPRA 12 del progetto GeoSciencesIR (Research Infrastructure)
fn: GeoSciencesIR (Research Infrastructure) project Unit ISPRA 12 @en

Tecnica di laboratorio
type: Concept
definition: No definition needed @en
definition: Non è necessaria alcuna definizione
preferred label: Laboratory technique @en
notation: 1
top concept of: Vocabolario dei metodi di datazione.
in scheme: Vocabolario dei metodi di datazione.
narrower: Spettrometria di massa con acceleratore
narrower: Risonanza di spin degli elettroni
narrower: Luminascenza stimolata otticamente
narrower: Termoluminescenza
narrower: Radiocarbonio
narrower: Racemizzazione degli amminoacidi
narrower: Datazione Uranio Torio
narrower: Datazione Argon Argon
narrower: Datazione Potassio Argon
narrower: Nuclide cosmogenico terrestre

Spettrometria di massa con acceleratore
type: Concept
definition: Measurement of the number of 14C, 12C and 13C atoms present in the sample. With this data, it is possible to know their concentration ratio and to assess their level of fractionation. @en
definition: misura del numero di atomi di 14C, 12C e 13C presenti nel campione. Con questi dati è possibile conoscere il loro rapporto di concentrazione e valutare il loro livello di frazionamento.
preferred label: Accelerator mass spectrometry @en
notation: 1.1
in scheme: Vocabolario dei metodi di datazione.
bibliographic citation: https://www.radiocarbon.com/italiano/spettrometro-di-massa-con-acceleratore.htm
broader: Tecnica di laboratorio

Risonanza di spin degli elettroni
type: Concept
definition: Spectroscopy technique that allow the study of stable or persistent free radicals @en
definition: tecnica di spettroscopia che consente lo studio di radicali liberi stabili o persistenti
preferred label: Electron spin resonance @en
notation: 1.2
in scheme: Vocabolario dei metodi di datazione.
bibliographic citation: https://en.wikipedia.org/wiki/Electron_paramagnetic_resonance
broader: Tecnica di laboratorio

Luminascenza stimolata otticamente
type: Concept
definition: Mesurement of the intensity of light emitted by the sample under stimulation with visible radiation (optical stimulation) is measured. During the measurement, the luminescence emission curve is recorded as a function of time @en
definition: La misurazione dell'intensità della luce emessa dal campione sotto stimolazione con radiazioni visibili (stimolazione ottica). Durante la misurazione, la curva di emissione della luminescenza viene registrata in funzione del tempo.
preferred label: Optically stimulated luminescence @en
notation: 1.3
in scheme: Vocabolario dei metodi di datazione.
bibliographic citation: https://en.wikipedia.org/wiki/Optically_stimulated_luminescence
broader: Tecnica di laboratorio

Termoluminescenza
type: Concept
definition: Emission of light from some minerals and certain other crystalline materials. It is used in archaeology for dating ceramics, many of whose components, such as quartz and feldspars, are thermoluminescent. @en
definition: Emissione di luce da parte di alcuni minerali e di alcuni altri materiali cristallini. È utilizzata in archeologia per datare le ceramiche, molti dei cui componenti, come il quarzo e i feldspati, sono termoluminescenti.
preferred label: Thermoluminescence @en
notation: 1.4
in scheme: Vocabolario dei metodi di datazione.
bibliographic citation: Thermoluminescence - Wikipedia
bibliographic citation: Thermoluminescence | Dating, Radiation & Luminescence | Britannica
broader: Tecnica di laboratorio

Radiocarbonio
type: Concept
definition: Measurement of the residual amount of 14C atoms in an organic sample and thus it allow to calculate how much time has elapsed since its death @en
definition: misura la quantità residua di atomi di 14C in un campione organico e permette quindi di calcolare quanto tempo è trascorso dalla sua morte
preferred label: Radiocarbon @en
notation: 1.5
in scheme: Vocabolario dei metodi di datazione.
bibliographic citation: https://en.wikipedia.org/wiki/Radiocarbon_dating
bibliographic citation: https://www.radiocarbon.com/italiano/datazione-al-carbonio.htm
broader: Tecnica di laboratorio

Racemizzazione degli amminoacidi
type: Concept
definition: A method for estimating the relative age since death by assessing the extent of postmortem conversion of biological chiral forms of amino acids (l-enantiomers) to their nonbiological counterparts (d-enantiomers). @en
definition: Un metodo per stimare l'età relativa dalla morte valutando l'entità della conversione postmortem delle forme biologiche chirali degli aminoacidi (l-enantiomeri) nelle loro controparti non biologiche (d-enantiomeri).
preferred label: Racemization of amino acids @en
notation: 1.6
in scheme: Vocabolario dei metodi di datazione.
bibliographic citation: https://en.wikipedia.org/wiki/Amino_acid_dating
bibliographic citation: https://link.springer.com/referenceworkentry/10.1007/978-94-007-6326-5_73-1
broader: Tecnica di laboratorio

Datazione Uranio Torio
type: Concept
definition: analysis of isotope ratios of the "parent" isotope (234U) and the "child" isotope (230T). These ratios allow the decay of the parent isotope and the subsequent production of the child isotope over time to be measured. @en
definition: analisi dei rapporti isotopici dell'isotopo "genitore" (234U) e dell'isotopo "figlio" (230T). Questi rapporti consentono di misurare il decadimento dell'isotopo genitore e la successiva produzione dell'isotopo figlio nel tempo.
preferred label: Uranium Thorium dating @en
notation: 1.7
in scheme: Vocabolario dei metodi di datazione.
bibliographic citation: https://en.wikipedia.org/wiki/Uranium-thorium_dating
broader: Tecnica di laboratorio

Datazione Argon Argon
type: Concept
definition: mesurement of the neutron irradiation emitted by a nuclear reactor to convert the stable form of potassium (39K) into the radioactive 39Ar. @en
definition: misura dell'irradiazione neutronica emessa da un reattore nucleare per convertire la forma stabile del potassio (39K) nella forma radioattiva 39Ar.
preferred label: Argon Argon dating @en
notation: 1.8
in scheme: Vocabolario dei metodi di datazione.
bibliographic citation: https://en.wikipedia.org/wiki/Uranium-thorium_dating
broader: Tecnica di laboratorio

Datazione Potassio Argon
type: Concept
definition: measurement of the product of the radioactive decay of a potassium (K) isotope into argon (Ar) @en
definition: misura del prodotto del decadimento radioattivo di un isotopo del potassio (K) in argon (Ar)
preferred label: Potassium Argon dating @en
notation: 1.9
in scheme: Vocabolario dei metodi di datazione.
bibliographic citation: https://en.wikipedia.org/wiki/K-Ar_dating
bibliographic citation: https://www.britannica.com/science/potassium-argon-dating
broader: Tecnica di laboratorio

Nuclide cosmogenico terrestre
type: Concept
definition: measurement of the concentration of terrestrial cosmogenic isotopes that have accumulated in rocks or sediments due to the interaction between cosmic radiation and the Earth's surface. @en
definition: misura della concentrazione di isotopi cosmogenici terrestri che si sono accumulati nelle rocce o nei sedimenti a causa dell'interazione tra la radiazione cosmica e la superficie terrestre.
preferred label: Terrestrial cosmogenic nuclide @en
notation: 1.10
in scheme: Vocabolario dei metodi di datazione.
bibliographic citation: https://en.wikipedia.org/wiki/Cosmogenic_nuclide
broader: Tecnica di laboratorio

Dato archeologico
type: Concept
definition: dating based on the finding of ceramic material (e.g. pottery shards, tiles) of historical times @en
definition: datazione basata sul ritrovamento di materiale ceramico (ad esempio frammenti di ceramica, piastrelle) di epoca storica
preferred label: Archaeological data @en
notation: 2
top concept of: Vocabolario dei metodi di datazione.
in scheme: Vocabolario dei metodi di datazione.
bibliographic citation: ITHACA Working Group

Considerazioni morfolitostratigrafiche
type: Concept
definition: relative dating based on morphological, stratigraphic and lithological correlation with previously dated geomorphological and stratigraphic markers. @en
definition: datazione relativa basata sulla correlazione morfologica, stratigrafica e litologica con marcatori geomorfologici e stratigrafici precedentemente datati.
preferred label: Morpholithostratigraphic considerations @en
notation: 3
top concept of: Vocabolario dei metodi di datazione.
in scheme: Vocabolario dei metodi di datazione.
bibliographic citation: ITHACA Working Group

Fagliazione superficiale e Radiocarbonio
type: Concept
definition: dating based on the combination of the observation of a seismic event that generated the recent ground rupture, constrained chronologically by the radiometric dating of a sample @en
definition: datazione basata sulla combinazione dell'osservazione di un evento sismico che ha generato la frattura recente del terreno, vincolata cronologicamente dalla datazione radiometrica di un campione
preferred label: Surface faulting and Radiocarbon @en
notation: 4
top concept of: Vocabolario dei metodi di datazione.
in scheme: Vocabolario dei metodi di datazione.
bibliographic citation: ITHACA Working Group

Dato archeologico e Radiocarbonio
type: Concept
definition: dating constrained by the finding of ceramic fragments and samples dating by radiocarbon methods @en
definition: datazione vincolata dal ritrovamento di frammenti ceramici e campioni datati con metodi al radiocarbonio
preferred label: Archaeological data and Radiocarbon @en
notation: 5
top concept of: Vocabolario dei metodi di datazione.
in scheme: Vocabolario dei metodi di datazione.
bibliographic citation: ITHACA Working Group

Radiocarbonio e considerazioni morfolitostratigrafiche
type: Concept
definition: dating based on the combination of relative ages from morpho-litho-stratigraphic considerations and constrained chronologically by the radiocarbon method @en
definition: datazione basata sulla combinazione di età relative derivanti da considerazioni morfo-lito-stratigrafiche e vincolate cronologicamente dal metodo del radiocarbonio
preferred label: Radiocarbon and morpholithostratigraphic considerations @en
notation: 6
top concept of: Vocabolario dei metodi di datazione.
in scheme: Vocabolario dei metodi di datazione.
bibliographic citation: ITHACA Working Group

Fagliazione superficiale
type: Concept
definition: cosismic effect which consists of the permanent rupture of the ground surface, that occurs along an active and capable fault during an earthquake. @en
definition: effetto cosismico che consiste nella rottura permanente della superficie del suolo, che si verifica lungo una faglia attiva e capace durante un terremoto.
preferred label: Surface faulting @en
notation: 7
top concept of: Vocabolario dei metodi di datazione.
in scheme: Vocabolario dei metodi di datazione.
bibliographic citation: ITHACA - Catalogo delle faglie capaci — Italiano (isprambiente.gov.it)
bibliographic citation: Linee Guida Tecniche IAEA (2015, 2022)