Vocabolario della Struttura del suolo
type: ConceptScheme
type: Dataset
type: Asset
title: Soil texture Vocabulary @en
description: The terms describe the classification of soil by the proportion and graduations of the three size groups of soil grains, i.e., sand, silt and clay, present in the soil. @en
description: I termini descrivono la classificazione del suolo si basa sulla proporzione e graduazione dei tre gruppi di dimensioni dei granuli di suolo, ossia sabbia, limo e argilla, presenti nel suolo.
issued: 2025-02-01
modified: 2025-02-01
creator: TUS1-Un
creator: ISPRA17
rights holder: Universita' degli Studi della Tuscia di Viterbo
rights holder: Istituto Superiore per la Protezione e la Ricerca Ambientale
version info: 1.0
language: ITA
language: ENG
theme: so
theme: mr
keyword: Cava
keyword: GeoSciencesIR @en
keyword: Rosorse naturali
keyword: Cartografia
keyword: Mineral resources @en
keyword: Querry @en
accrual periodicity: IRREG
distribution: mine-soilTextures-RDF-TURTLE
type: CodeList
contact point: TUS1-Un
number of levels: 1
key concept: soilTextures
conforms to: SKOS
representation technique: SKOS
creator: Paoletti Matteo (ORCID: 0009-0000-3875-1895)
creator: Piscopo Vincenzo (ORCID: 0000-0001-8006-0940)
creator: Paolo Lino Manganello (ORCID: 0009-0008-5129-4391)
creator: Maria Pia Congi (ORCID: 0000-0002-9330-9554)
creator: Carlo Cipolloni (ORCID: 0000-0001-7652-9814)
creator: Elio Giulianelli (ORCID: 0000-0003-0998-9751)
comment: Il vocabolario è stato realizzato dall'Università della Tuscia nell'ambito di GeoSciencesIR per la caratterizzazione dell'ambiente di cava in particolare presenta una classificazione del suolo in base alla proporzione e alle graduazioni dei tre gruppi dimensionali dei granuli del suolo.
comment: The vocabulary was developed by the University of Tuscia as part of GeoSciencesIR for the characterization of quarry environments. In particular, it provides a soil classification based on the proportions and graduations of the three soil particle size groups. @en
publisher: Universita' degli Studi della Tuscia di Viterbo
publisher: Istituto Superiore per la Protezione e la Ricerca Ambientale
label: Vocabolario deila granumetria del suolo contatti tettonici
has top concept: Argilla
has top concept: Franco limoso argilloso
has top concept: Limo
has top concept: Franco argilloso
has top concept: Franco
has top concept: Argilla sabbiosa
has top concept: Franco Sabbioso
has top concept: Sabbia

Universita' degli Studi della Tuscia di Viterbo
type: NamedIndividual
type: Agent
type: Organization
type: Organisation
fn: Universita' degli Studi della Tuscia di Viterbo

TUS1-Un
type: NamedIndividual
type: Organization
type: Kind
fn: Unità UNITUS01 del progetto GeoSciencesIR (Research Infrastructure)
fn: GeoSciencesIR (Research Infrastructure) project Unit UNITUS01 @en

Istituto Superiore per la Protezione e la Ricerca Ambientale
type: NamedIndividual
type: Agent
type: Organization
type: Organisation
fn: Istituto Superiore per la Protezione e la Ricerca Ambientale

ISPRA17
type: NamedIndividual
type: Organization
type: Kind
fn: Unità ISPRA17 del progetto GeoSciencesIR (Research Infrastructure)
fn: GeoSciencesIR (Research Infrastructure) project Unit ISPRA17 @en

Distribuzione RDF/Turtle del vocabolario controllato GeoSciencesIR per le classi granulometriche del suolo in ambiente di cava.
type: Distribution
format: RDF TURTLE
license: A21 CCBY40
description: Questa è la Distribuzione RDF/Turtle del vocabolario controllato GeoSciencesIR per le classi granulometriche del suolo in ambiente di cava.
access URL: https://github.com/isprambiente/dati-semantic/tree/main/assets/controlled-vocabularies/mine/soilTextures
download URL: https://raw.githubusercontent.com/isprambiente/dati-semantic/main/assets/controlled-vocabularies/mine/soilTextures/soilTextures.ttl

Argilla
type: Concept
definition: Mud that consists of greater than 50 % particles with grain size less than 0.004 mm @en
definition: Fango che consiste in più del 50 percento di particelle con dimensioni di granello inferiori a 0,004 mm.
preferred label: Clay @en
notation: 1
top concept of: Vocabolario della Struttura del suolo
in scheme: Vocabolario della Struttura del suolo
bibliographic citation: United States Department of Agriculture (USDA). Soil Survey Staff. 2017. Soil Texture Classification using the USDA Textural Triangle.

Franco limoso argilloso
type: Concept
definition: It is a soil having 27 to 40 % of clay and less than 20 % of sand @en
definition: E' un suolo che ha tra il 27 e il 40 percento di argilla e meno del 20 percento di sabbia.
preferred label: Silty clay-loam @en
notation: 2
top concept of: Vocabolario della Struttura del suolo
in scheme: Vocabolario della Struttura del suolo
bibliographic citation: United States Department of Agriculture (USDA). Soil Survey Staff. 2017. Soil Texture Classification using the USDA Textural Triangle.

Limo
type: Concept
definition: Mud that consists of greater than 50 % silt-size grains. @en
definition: Fango che consiste in più del 50% di particelle di dimensioni silt
preferred label: Silt @en
notation: 3
top concept of: Vocabolario della Struttura del suolo
in scheme: Vocabolario della Struttura del suolo
bibliographic citation: United States Department of Agriculture (USDA). Soil Survey Staff. 2017. Soil Texture Classification using the USDA Textural Triangle.

Franco argilloso
type: Concept
definition: A fine-textured soil containing 27% to 40% clay, 20% to 45% sand, and the remainder silt @en
definition: Un suolo a tessitura fine contenente dal 27% al 40% di argilla, dal 20% al 45% di sabbia, e il resto di limo.
preferred label: Clay - Loam @en
notation: 4
top concept of: Vocabolario della Struttura del suolo
in scheme: Vocabolario della Struttura del suolo
bibliographic citation: United States Department of Agriculture (USDA). Soil Survey Staff. 2017. Soil Texture Classification using the USDA Textural Triangle.

Franco
type: Concept
definition: Loam is soil composed mostly of sand, silt , and a smaller amount of clay @en
definition: Il Franco è un suolo composto principalmente da sabbia, limo e una quantità minore di argilla.
preferred label: Loam @en
notation: 5
top concept of: Vocabolario della Struttura del suolo
in scheme: Vocabolario della Struttura del suolo
bibliographic citation: United States Department of Agriculture (USDA). Soil Survey Staff. 2017. Soil Texture Classification using the USDA Textural Triangle.

Argilla sabbiosa
type: Concept
definition: soil with more than 35 or more % of clay and 45 or more % of sand. @en
definition: Suolo con più del 35% di argilla e più del 45% di sabbia.
preferred label: Sandy Clay @en
notation: 6
top concept of: Vocabolario della Struttura del suolo
in scheme: Vocabolario della Struttura del suolo
bibliographic citation: United States Department of Agriculture (USDA). Soil Survey Staff. 2017. Soil Texture Classification using the USDA Textural Triangle.

Franco Sabbioso
type: Concept
definition: Soil withf less than 7 % clay, less than 50 % silt, and between 43 and 50 % sand. @en
definition: Suolo con meno del 7% di argilla, meno del 50% di limo e tra il 43% e il 50% di sabbia.
preferred label: Sandy Loam @en
notation: 7
top concept of: Vocabolario della Struttura del suolo
in scheme: Vocabolario della Struttura del suolo
bibliographic citation: United States Department of Agriculture (USDA). Soil Survey Staff. 2017. Soil Texture Classification using the USDA Textural Triangle.

Sabbia
type: Concept
definition: Clastic sediment in which less than 30 % of particles are gravel and the sand to mud ratio is at least 1. @en
definition: Sedimento clastico in cui meno del 30 percento delle particelle sono ghiaia e il rapporto sabbia/limo è almeno 1.
preferred label: Sand @en
notation: 8
top concept of: Vocabolario della Struttura del suolo
in scheme: Vocabolario della Struttura del suolo
bibliographic citation: United States Department of Agriculture (USDA). Soil Survey Staff. 2017. Soil Texture Classification using the USDA Textural Triangle.