Vocabolario del materiale delle frane.
type: ConceptScheme
type: Dataset
type: Asset
title: Vocabulary of main landslide materials. @en
description: Terms that describe the type of main material that makes up the landslide. @en
description: Termini che descrivono la tipologia del materiale principale che compone la frana.
issued: 2024-06-04
modified: 2024-06-04
creator: ISPRA07
rights holder: Istituto Superiore per la Protezione e la Ricerca Ambientale
version info: 1.0
language: ITA
language: ENG
theme: ge
theme: nz
keyword: Frana
keyword: GeoSciencesIR @en
keyword: Dissesto idrogeologico
keyword: Geologia applicata
keyword: Landslides @en
keyword: Slope instabilities @en
accrual periodicity: IRREG
distribution: Distribuzione RDF/Turtle del vocabolario controllato GeoSciencesIR per il tipo di materiale della frana
type: CodeList
contact point: ISPRA07
number of levels: 1
key concept: mainMaterials
conforms to: SKOS
representation technique: SKOS
creator: Alessandro Trigila (ORCID: 0000-0001-8145-1804)
creator: Carla Iadanza (ORCID: 0000-0002-7763-4840)
creator: Davide Romano (ORCID: )
creator: Paolo Lino Manganello (ORCID: 0009-0008-5129-4391)
creator: Mariapia Congi (ORCID: 0000-0002-9330-9554)
creator: Carlo Cipolloni (ORCID: 0000-0001-7652-9814)
creator: Elio Giulianelli (ORCID: 0000-0003-0998-9751)
comment: La classificazioni è stata predisposta per il censimento dei fenomeni franosi realizzato con il progetto IFFI sulla base delle classificazioni definite da Cruden & Varnes 1996.
comment: The classification was developed for the landslide census carried out by the IFFI project, based on the classifications defined by Cruden & Varnes (1996). @en
publisher: Istituto Superiore per la Protezione e la Ricerca Ambientale
has top concept: Roccia
has top concept: Detrito
has top concept: Terra
has top concept: Ghiaccio
has top concept: Non definito

Istituto Superiore per la Protezione e la Ricerca Ambientale
type: NamedIndividual
type: Agent
type: Organization
type: Organisation
fn: Istituto Superiore per la Protezione e la Ricerca Ambientale

Distribuzione RDF/Turtle del vocabolario controllato GeoSciencesIR per il tipo di materiale della frana
type: Distribution
format: RDF TURTLE
license: A21 CCBY40
title: RDF/Turtle distribution of the GeoSciencesIR controlled vocabulary for landslide material. @en
description: Questa è la Distribuzione RDF/Turtle del vocabolario controllato GeoSciencesIR per il tipo di materiale della frana
description: This is the RDF/Turtle distribution of the GeoSciencesIR controlled vocabulary for landslide material. @en
access URL: https://github.com/isprambiente/dati-semantic/tree/main/assets/controlled-vocabularies/instabilities/mainMaterials
download URL: https://raw.githubusercontent.com/isprambiente/dati-semantic/main/assets/controlled-vocabularies/instabilities/mainMaterials/mainMaterials.ttl

ISPRA07
type: NamedIndividual
type: Organization
type: Kind
fn: Unità 07 del progetto GeoSciencesIR (Research Infrastructure)
fn: GeoSciencesIR (Research Infrastructure) project Unit 07 @en

Roccia
type: Concept
definition: Massa lapidea che era intatta prima dell'inizio del movimento di frana @en
definition: A hard or firm mass that was intact and in its natural place before the initiation of movement
preferred label: Rock @en
alternative label: Materiale roccioso
notation: 1
top concept of: Vocabolario del materiale delle frane.
in scheme: Vocabolario del materiale delle frane.
bibliographic citation: Cruden, D.M. & Varnes, D.J. (1996) Landslides: Investigation and Mitigation. Chapter 3 Landslide Types and Processes. Transportation Research Board Special Report, 247

Detrito
type: Concept
definition: Aggregato di particelle solide contenente una significante proporzione di materiale grossolano @en
definition: An aggregate of solid particles containing significant proportion of coarse material
preferred label: Debris @en
alternative label: Materiale detritico
notation: 2
top concept of: Vocabolario del materiale delle frane.
in scheme: Vocabolario del materiale delle frane.
bibliographic citation: Cruden, D.M. & Varnes, D.J. (1996) Landslides: Investigation and Mitigation. Chapter 3 Landslide Types and Processes. Transportation Research Board Special Report, 247

Terra
type: Concept
definition: Aggregato di particelle solide in cui l'80% o più delle particelle ha dimensioni inferiori a 2 mm @en
definition: An aggregate of solid particles in which 80 percent or more of the particles are smaller than 2 mm
preferred label: Earth @en
alternative label: Materiale terroso
notation: 3
top concept of: Vocabolario del materiale delle frane.
in scheme: Vocabolario del materiale delle frane.
bibliographic citation: Cruden, D.M. & Varnes, D.J. (1996) Landslides: Investigation and Mitigation. Chapter 3 Landslide Types and Processes. Transportation Research Board Special Report, 247

Ghiaccio
type: Concept
definition: Il materiale franato consiste in ghiaccio @en
definition: The landslide material contains ice
preferred label: Ice @en
notation: 4
top concept of: Vocabolario del materiale delle frane.
in scheme: Vocabolario del materiale delle frane.
bibliographic citation: Hungr, O., Leroueil, S. & Picarelli, L. The Varnes classification of landslide types, an update. Landslides 11, 167–194 (2014).

Non definito
type: Concept
definition: Il tipo di materiale non è determinato @en
definition: The type of material is not determined
preferred label: Not defined @en
alternative label: N.D.
notation: 5
top concept of: Vocabolario del materiale delle frane.
in scheme: Vocabolario del materiale delle frane.