Vocabolario degli elementi di danno
type: ConceptScheme
type: Dataset
type: Asset
title: Vocabulary of damage elements. @en
description: Classification of elements that have suffered damage. @en
description: Classificazione degli elementi che hanno subito danni.
issued: 2024-06-04
modified: 2024-06-04
creator: ISPRA07
rights holder: Istituto Superiore per la Protezione e la Ricerca Ambientale
version info: 1.0
language: ITA
language: ENG
theme: nz
theme: ge
keyword: Frana
keyword: GeoSciencesIR @en
keyword: Rischio geologico
keyword: Landslides
accrual periodicity: IRREG
distribution: instabilities-damageGroups-RDF-TURTLE
type: Taxonomy
contact point: ISPRA07
number of levels: 3
key concept: damagedGroups
conforms to: SKOS
representation technique: SKOS
creator: Alessandro Trigila (ORCID: 0000-0001-8145-1804)
creator: Carla Iadanza (ORCID: 0000-0002-7763-4840)
creator: Davide Romano (ORCID: )
creator: Paolo Lino Manganello (ORCID: 0009-0008-5129-4391)
creator: Mariapia Congi (ORCID: 0000-0002-9330-9554)
creator: Carlo Cipolloni (ORCID: 0000-0001-7652-9814)
creator: Elio Giulianelli (ORCID: 0000-0003-0998-9751)
comment: La classificazioni è stata predisposta per il censimento dei fenomeni franosi realizzato con il progetto IFFI sulla base delle classificazioni definite da Cruden & Varnes 1996.
comment: The classification was developed for the landslide census carried out by the IFFI project, based on the classifications defined by Cruden & Varnes (1996). @en
publisher: Istituto Superiore per la Protezione e la Ricerca Ambientale
has top concept: economic
has top concept: heritage
has top concept: social
has top concept: environmental
has top concept: notDefined

Istituto Superiore per la Protezione e la Ricerca Ambientale
type: NamedIndividual
type: Agent
type: Organization
type: Organosation
fn: Istituto Superiore per la Protezione e la Ricerca Ambientale

Distribuzione RDF/Turtle del vocabolario controllato GeoSciencesIR per le classi di danni per evento naturale.
type: Distribution
format: RDF TURTLE
license: A21 CCBY40
title: RDF/Turtle distribution of the controlled vocabulary within GeoSciencsIR for event damage groups. @en
description: Questa è la Distribuzione RDF/Turtle del vocabolario controllato GeoSciencesIR per le classi di danni per evento naturale.
description: This is the RDF/Turtle distribution of the controlled vocabulary within GeoSciencsIR for event damage groups. @en
access URL: https://github.com/isprambiente/dati-semantic/tree/main/assets/controlled-vocabularies/instabilities/damagedGroups
download URL: https://raw.githubusercontent.com/isprambiente/dati-semantic/main/assets/controlled-vocabularies/instabilities/damagedGroups/damagedGroups.ttl

ISPRA07
type: NamedIndividual
type: Organization
type: Kind
fn: Unità ISPRA 07 del progetto GeoSciencesIR (Research Infrastructure)
fn: GeoSciencesIR (Research Infrastructure) project Unit ISPRA 07 @en

Danno economico
type: Concept
definition: Any object related to property, economics or monetary issues @en
definition: Qualsiasi oggetto correlato a proprietà ed elementi economici o monetari
preferred label: Economic damage @en
notation: 1
top concept of: Vocabolario degli elementi di danno
in scheme: Vocabolario degli elementi di danno

Attività economiche
type: Concept
definition: Any object representing an economic activity, such as an industry @en
definition: Qualsiasi oggetto rappresentante un'attività economica, come ad esempio un'industria
preferred label: Economic activity @en
notation: 1.1
in scheme: Vocabolario degli elementi di danno
broader: economic

Infrastrutture
type: Concept
definition: Any object considered as a structure providing a service, such as a road, a bridge, a military facility, etc @en
definition: Qualsiasi oggetto rappresentante una struttura che fornisce un servizio, come ad esempio una strada, un ponte, una struttura militare, etc
preferred label: Infrastructure @en
notation: 1.2
in scheme: Vocabolario degli elementi di danno
broader: economic
narrower: Opere e infrastrutture di servizio
narrower: Ferrovie
narrower: Strade
narrower: Mezzi di trasporto

Opere e infrastrutture di servizio
type: Concept
definition: Any object considered as service infrastructure or work @en
definition: Qualsiasi oggetto che rappresenta un'infrastruttura o un'opera di servizio
preferred label: Lifelines @en
notation: 1.2.1
in scheme: Vocabolario degli elementi di danno
broader: Infrastrutture

Ferrovie
type: Concept
definition: Railways network @en
definition: Rete ferroviaria
preferred label: Railways @en
notation: 1.2.2
in scheme: Vocabolario degli elementi di danno
broader: Infrastrutture

Strade
type: Concept
definition: Road network @en
definition: Rete viaria
preferred label: Roads @en
notation: 1.2.3
in scheme: Vocabolario degli elementi di danno
broader: Infrastrutture

Mezzi di trasporto
type: Concept
definition: Vehicles to transport people or goods @en
definition: Veicoli per trasportare persone o cose
preferred label: Means of transport @en
notation: 1.2.4
in scheme: Vocabolario degli elementi di danno
broader: Infrastrutture

Proprietà
type: Concept
definition: Any object subject to ownership, such as a house @en
definition: Qualsiasi oggetto che è proprietà di qualcuno, come ad esempio una casa
preferred label: Property @en
notation: 1.3
in scheme: Vocabolario degli elementi di danno
broader: economic
narrower: Nuclei/ centri abitati
narrower: Edifici isolati/case sparse

Nuclei/ centri abitati
type: Concept
definition: Groups of buildings and houses forming an urban centre
preferred label: Urban centres @en
notation: 1.3.1
in scheme: Vocabolario degli elementi di danno
broader: Proprietà

Edifici isolati/case sparse
type: Concept
definition: Buildings and houses outside urban centres @en
definition: Edifici e case ubicati al di fuori dei centri urbani
preferred label: Scattered buildings/ Houses @en
notation: 1.3.2
in scheme: Vocabolario degli elementi di danno
broader: Proprietà

Terreni ad uso rurale
type: Concept
definition: Any non-urban object that is dedicated to any given use @en
definition: Qualsiasi oggetto non urbano dedicato ad un determinato uso
preferred label: Rural land use @en
notation: 1.4
in scheme: Vocabolario degli elementi di danno
broader: economic
narrower: Terreno agricolo

Terreno agricolo
type: Concept
definition: Non-urban land that is dedicated to agriculture or farming @en
definition: Terreno dedicato ad attività agricole
preferred label: Farm land Forests @en
notation: 1.4.1
in scheme: Vocabolario degli elementi di danno
broader: Terreni ad uso rurale

Beni Culturali
type: Concept
definition: Anything related to relevant objects from a cultural or heritage perspective @en
definition: Tutto ciò che riguarda oggetti rilevanti dal punto di vista culturale e del patrimonio
preferred label: Heritage @en
notation: 2
top concept of: Vocabolario degli elementi di danno
in scheme: Vocabolario degli elementi di danno

Sociale
type: Concept
definition: Anything related to people or groups of people @en
definition: Qualsiasi cosa correlata a persone o gruppi di persone
preferred label: Social @en
notation: 3
top concept of: Vocabolario degli elementi di danno
in scheme: Vocabolario degli elementi di danno
narrower: Servizio sociale

Servizio sociale
type: Concept
definition: Any service provided to people @en
definition: Qualsiasi servizio fornito alla popolazione
preferred label: Social service @en
notation: 3.1
in scheme: Vocabolario degli elementi di danno
broader: social
narrower: Strutture di servizio pubblico

Strutture di servizio pubblico
type: Concept
definition: Any structure providing service to people @en
definition: Qualsiasi struttura che fornisce servizi alla popolazione
preferred label: Public service facilities @en
notation: 3.1.1
in scheme: Vocabolario degli elementi di danno
broader: Servizio sociale

Ambientale
type: Concept
definition: An area subject to a given protection level, such as a natural park @en
definition: Area soggetta ad un livello di protezione, come ad esempio un parco naturale
preferred label: Environmental @en
notation: 4
top concept of: Vocabolario degli elementi di danno
in scheme: Vocabolario degli elementi di danno
narrower: Opere di sistemazione
narrower: Corpo idrico

Opere di sistemazione
type: Concept
definition: Works aimed at reducing the risk @en
definition: Opere volte a mitigare il rischio
preferred label: Remedial works @en
notation: 4.1
in scheme: Vocabolario degli elementi di danno
broader: environmental

Corpo idrico
type: Concept
definition: Any significant accumulation of water @en
definition: Qualsiasi accumulo significativo di acqua
preferred label: Water body @en
notation: 4.2
in scheme: Vocabolario degli elementi di danno
broader: environmental
narrower: Corso d'acqua

Corso d'acqua
type: Concept
definition: Water course, such as a river @en
definition: Corpo d'acqua superficiale, come ad esempio un fiume
preferred label: Water course @en
notation: 4.2.1
in scheme: Vocabolario degli elementi di danno
broader: Corpo idrico

Non definito
type: Concept
definition: The damaged element is not determined @en
definition: L'elemento danneggiato non è determinato
preferred label: Not defined @en
notation: 5
top concept of: Vocabolario degli elementi di danno
in scheme: Vocabolario degli elementi di danno