Vocabolario dei temi scientifici del geosito.
type: ConceptScheme
type: Dataset
type: Asset
title: Scientific themes vocabulary related to geosite. @en
description: The terms in this dictionary report the list of scientific themes that can be associated with a geosite. @en
description: I termini del presente vocabolario riportano la lista dei temi scientifici associabili ad un geosito.
issued: 2024-07-01
modified: 2024-07-01
creator: ISPRA02
rights holder: Istituto Superiore per la Protezione e la Ricerca Ambientale
version info: 1
language: ITA
language: ENG
theme: ge
theme: lu
keyword: Geologia
keyword: GeoSciencesIR @en
keyword: Gestione del territorio
keyword: Geomorfologia
keyword: Sistema informativo
keyword: Geomorphology @en
accrual periodicity: IRREG
distribution: geosites-scientificThemes-RDF-TURTLE
type: CodeList
contact point: ISPRA02
number of levels: 1
key concept: scientificThemes
conforms to: SKOS
representation technique: SKOS
creator: Elisa Brustia (ORCID: 0009-0001-5893-7651)
creator: Marina Funaro
creator: Mauro Lucarini (ORCID: 0000-0001-8730-7221)
creator: Luca Olivetta
creator: Roberto Pompili (ORCID: 0000-0003-3001-7295)
creator: Paolo Primerano (ORCID: 0000-0001-9362-766X)
creator: Paolo Lino Manganello (ORCID: 0009-0008-5129-4391)
creator: Mariapia Congi (ORCID: 0000-0002-9330-9554)
creator: Carlo Cipolloni (ORCID: 0000-0001-7652-9814)
creator: Elio Giulianelli (ORCID: 0000-0003-0998-9751)
comment: Processo specifico per l'armonizzazione del database Inventario Nazionale dei Geositi di ISPRA.
comment: Specific process for the harmonization of the ISPRA National Inventory of Geosites database. @en
publisher: Istituto Superiore per la Protezione e la Ricerca Ambientale
has top concept: geologia applicata
has top concept: carsismo
has top concept: geografia
has top concept: geomorfologia
has top concept: storia della geologia
has top concept: idrogeologia
has top concept: litologia
has top concept: geologia marina
has top concept: mineralogia
has top concept: deposito minerario
has top concept: paleontologia
has top concept: pedologia
has top concept: petrografia
has top concept: sedimentologia
has top concept: geologia stratigrafica
has top concept: stratigrafia
has top concept: geologia strutturale
has top concept: vulcanologia

Istituto Superiore per la Protezione e la Ricerca Ambientale
type: NamedIndividual
type: Agent
type: Organization
type: Organosation
fn: Istituto Superiore per la Protezione e la Ricerca Ambientale

Distribuzione RDF/Turtle del vocabolario controllato GeoSciencesIR per i temi di rilevanza scientifica associati al geosito.
type: Distribution
format: RDF TURTLE
license: A21 CCBY40
title: Specific process for the harmonization of the ISPRA National Geosite Inventory database. @en
description: Questa è la Distribuzione RDF/Turtle del vocabolario controllato GeoSciencesIR per i temi di rilevanza scientifica associati al geosito.
description: This is the Specific process for the harmonization of the ISPRA National Geosite Inventory database. @en
access URL: https://github.com/isprambiente/dati-semantic/tree/main/assets/controlled-vocabularies/geosites/scientificThemes
download URL: https://raw.githubusercontent.com/isprambiente/dati-semantic/main/assets/controlled-vocabularies/geosites/scientificThemes/scientificThemes.ttl

ISPRA02
type: NamedIndividual
type: Organization
type: Kind
fn: Unità ISPRA 02 del progetto GeoSciencesIR (Research Infrastructure)
fn: GeoSciencesIR (Research Infrastructure) project Unit ISPRA 02 @en

geologia applicata
type: Concept
preferred label: Applied geology @en
notation: 1
top concept of: Vocabolario dei temi scientifici del geosito.
in scheme: Vocabolario dei temi scientifici del geosito.

carsismo
type: Concept
preferred label: Karst @en
notation: 2
top concept of: Vocabolario dei temi scientifici del geosito.
in scheme: Vocabolario dei temi scientifici del geosito.

geografia
type: Concept
definition: a science which has as its object the study, description and representation of the Earth @en
definition: scienza che ha per oggetto lo studio, la descrizione e la rappresentazione della Terra
preferred label: Geography @en
notation: 3
top concept of: Vocabolario dei temi scientifici del geosito.
in scheme: Vocabolario dei temi scientifici del geosito.
bibliographic citation: https://www.treccani.it/vocabolario/geografia/

geomorfologia
type: Concept
preferred label: Geomorphology @en
notation: 4
top concept of: Vocabolario dei temi scientifici del geosito.
in scheme: Vocabolario dei temi scientifici del geosito.

storia della geologia
type: Concept
definition: history of science which describe the composition, structure and evolution of the Earth @en
definition: storia della scienza che tratta della composizione, struttura ed evoluzione della Terra
preferred label: Geological history @en
notation: 5
top concept of: Vocabolario dei temi scientifici del geosito.
in scheme: Vocabolario dei temi scientifici del geosito.
bibliographic citation: https://it.wikipedia.org/wiki/Storia_della_geologia

idrogeologia
type: Concept
preferred label: Hydrogeology @en
notation: 6
top concept of: Vocabolario dei temi scientifici del geosito.
in scheme: Vocabolario dei temi scientifici del geosito.

litologia
type: Concept
preferred label: Lithology @en
notation: 7
top concept of: Vocabolario dei temi scientifici del geosito.
in scheme: Vocabolario dei temi scientifici del geosito.

geologia marina
type: Concept
definition: science about the genesis and evolution of submerged areas @en
definition: scienza che studia la genesi ed evoluzione delle aree sommerse
preferred label: Marine geology @en
notation: 8
top concept of: Vocabolario dei temi scientifici del geosito.
in scheme: Vocabolario dei temi scientifici del geosito.
bibliographic citation: https://en.wikipedia.org/wiki/Marine_geology

mineralogia
type: Concept
preferred label: Minerarology @en
notation: 9
top concept of: Vocabolario dei temi scientifici del geosito.
in scheme: Vocabolario dei temi scientifici del geosito.

deposito minerario
type: Concept
preferred label: Mine deposit @en
notation: 10
top concept of: Vocabolario dei temi scientifici del geosito.
in scheme: Vocabolario dei temi scientifici del geosito.

paleontologia
type: Concept
preferred label: Paleontology @en
notation: 11
top concept of: Vocabolario dei temi scientifici del geosito.
in scheme: Vocabolario dei temi scientifici del geosito.

pedologia
type: Concept
preferred label: Pedology @en
notation: 12
top concept of: Vocabolario dei temi scientifici del geosito.
in scheme: Vocabolario dei temi scientifici del geosito.

petrografia
type: Concept
definition: science about the origin, structure and composition of rocks @en
definition: scienza che studia l'origine, la struttura e la composizione delle rocce
preferred label: Petrography @en
alternative label: petrologia
notation: 13
top concept of: Vocabolario dei temi scientifici del geosito.
in scheme: Vocabolario dei temi scientifici del geosito.
bibliographic citation: https://www.treccani.it/enciclopedia/petrografia/

sedimentologia
type: Concept
preferred label: Sedimentology @en
notation: 14
top concept of: Vocabolario dei temi scientifici del geosito.
in scheme: Vocabolario dei temi scientifici del geosito.

geologia stratigrafica
type: Concept
preferred label: Stratigraphic geology @en
notation: 15
top concept of: Vocabolario dei temi scientifici del geosito.
in scheme: Vocabolario dei temi scientifici del geosito.

stratigrafia
type: Concept
definition: science about the dating of rocks and the mutual relationships between distinct rock units @en
definition: scienza che studia la datazione delle rocce ed i rapporti reciproci fra unità rocciose distinte
preferred label: stratigraphic @en
notation: 16
top concept of: Vocabolario dei temi scientifici del geosito.
in scheme: Vocabolario dei temi scientifici del geosito.
bibliographic citation: https://www.treccani.it/vocabolario/stratigrafia/

geologia strutturale
type: Concept
preferred label: Structural geology @en
notation: 17
top concept of: Vocabolario dei temi scientifici del geosito.
in scheme: Vocabolario dei temi scientifici del geosito.

vulcanologia
type: Concept
preferred label: Vulcanology @en
notation: 18
top concept of: Vocabolario dei temi scientifici del geosito.
in scheme: Vocabolario dei temi scientifici del geosito.