Vocabolario livello accessibilità ai geositi.
type: ConceptScheme
type: Dataset
type: Asset
title: Vocabulary level of accessibility to geosites. @en
description: The terms describe the various levels of difficulty for accessing geosites. @en
description: I termini descrivono i vali livelli di difficolta per accedere ai geositi.
issued: 2024-07-01
modified: 2024-07-01
creator: ISPRA02
rights holder: Istituto Superiore per la Protezione e la Ricerca Ambientale
version info: 1.0
language: ITA
language: ENG
theme: ge
theme: lu
theme: ps
keyword: Geologia
keyword: GeoSciencesIR @en
keyword: Gestione del territorio
keyword: Geomorfologia
keyword: Siti protetti
keyword: Protected site @en
accrual periodicity: IRREG
distribution: geosites-levelAccessibilities-RDF-TURTLE
type: CodeList
contact point: ISPRA02
number of levels: 1
key concept: levelAccessibility
conforms to: SKOS
representation technique: SKOS
creator: Elisa Brustia (ORCID: 0009-0001-5893-7651)
creator: Marina Funaro
creator: Mauro Lucarini (ORCID: 0000-0001-8730-7221)
creator: Luca Olivetta
creator: Roberto Pompili (ORCID: 0000-0003-3001-7295)
creator: Paolo Primerano (ORCID: 0000-0001-9362-766X)
creator: Paolo Lino Manganello (ORCID: 0009-0008-5129-4391)
creator: Mariapia Congi (ORCID: 0000-0002-9330-9554)
creator: Carlo Cipolloni (ORCID: 0000-0001-7652-9814)
creator: Elio Giulianelli (ORCID: 0000-0003-0998-9751)
comment: Processo specifico per l'armonizzazione del database Inventario Nazionale dei Geositi di ISPRA.
comment: Specific process for the harmonization of the ISPRA National Inventory of Geosites database. @en
publisher: Istituto Superiore per la Protezione e la Ricerca Ambientale
has top concept: Molto facile
has top concept: Facile
has top concept: Facile e pericoloso
has top concept: Difficile
has top concept: Molto difficile
has top concept: Difficile e pericoloso
has top concept: Per esperti
has top concept: Adatto ai disabili

Istituto Superiore per la Protezione e la Ricerca Ambientale
type: NamedIndividual
type: Agent
type: Organization
type: Organisation
fn: Istituto Superiore per la Protezione e la Ricerca Ambientale

Distribuzione RDF/Turtle del vocabolario controllato GeoSciencesIR per i livelli di accessibilità ai geositi.
type: Distribution
format: RDF TURTLE
license: A21 CCBY40
title: RDF/Turtle distribution of the GeoSciencesIR controlled vocabulary for geosite accessibility levels. @en
description: Questa è la Distribuzione RDF/Turtle del vocabolario controllato GeoSciencesIR per i livelli di accessibilità ai geositi.
description: This is the RDF/Turtle distribution of the GeoSciencesIR controlled vocabulary for geosite accessibility levels. @en
access URL: https://github.com/isprambiente/dati-semantic/tree/main/assets/controlled-vocabularies/instabilities/levelAccessibility
download URL: https://raw.githubusercontent.com/isprambiente/dati-semantic/main/assets/controlled-vocabularies/instabilities/levelAccessibility/levelAccessibility.ttl

ISPRA02
type: NamedIndividual
type: Organization
type: Kind
fn: Unità 02 del progetto GeoSciencesIR (Research Infrastructure)
fn: GeoSciencesIR (Research Infrastructure) project Unit 02 @en

Molto facile
type: Concept
definition: The access to the site is very easy @en
definition: il grado di difficoltà per accedere al sito è molto facile
preferred label: Very easy accessiblity @en
notation: 1
top concept of: Vocabolario livello accessibilità ai geositi.
in scheme: Vocabolario livello accessibilità ai geositi.

Facile
type: Concept
definition: The access to the site is easy @en
definition: il grado di difficoltà per accedere al sito è facile
preferred label: Easily accessible @en
notation: 2
top concept of: Vocabolario livello accessibilità ai geositi.
in scheme: Vocabolario livello accessibilità ai geositi.

Facile e pericoloso
type: Concept
definition: The access to the site is easy and dangerous @en
definition: il grado di difficoltà per accedere al sito è facile e pericoloso
preferred label: Easy and dangerous @en
notation: 3
top concept of: Vocabolario livello accessibilità ai geositi.
in scheme: Vocabolario livello accessibilità ai geositi.

Difficile
type: Concept
definition: The access to the site is difficult @en
definition: il grado di difficoltà per accedere al sito è difficile
preferred label: Difficult accessible @en
notation: 4
top concept of: Vocabolario livello accessibilità ai geositi.
in scheme: Vocabolario livello accessibilità ai geositi.

Molto difficile
type: Concept
definition: The access to the site is very difficult @en
definition: il grado di difficoltà per accedere al sito è molto difficile
preferred label: Very difficult accessibility @en
notation: 5
top concept of: Vocabolario livello accessibilità ai geositi.
in scheme: Vocabolario livello accessibilità ai geositi.

Difficile e pericoloso
type: Concept
definition: The access to the site is difficult and dangerous @en
definition: il grado di difficoltà per accedere al sito è difficile e pericoloso
preferred label: Difficult and dangerous @en
notation: 6
top concept of: Vocabolario livello accessibilità ai geositi.
in scheme: Vocabolario livello accessibilità ai geositi.

Per esperti
type: Concept
definition: The access to the site is for expert excursionists @en
definition: il grado di difficoltà per accedere al sito è per esperti
preferred label: For expert people @en
notation: 7
top concept of: Vocabolario livello accessibilità ai geositi.
in scheme: Vocabolario livello accessibilità ai geositi.

Adatto ai disabili
type: Concept
definition: The access to the site is suitable for people with disabilities @en
definition: il grado di difficoltà per accedere al sito è adatto alle persone con disabilità
preferred label: Disability friendly @en
notation: 8
top concept of: Vocabolario livello accessibilità ai geositi.
in scheme: Vocabolario livello accessibilità ai geositi.