Vocabulary of geographical position aspects of geosite.
type: ConceptScheme
type: Dataset
type: Asset
title: Vocabolario degli aspetti di posizione geografica del geosito. @en
description: The terms describe the different classes of geographical-geological position of the geosites. @en
description: I termini descrivono le diverse classi di posizione geografica-geologica dei geositi.
issued: 2024-07-01
modified: 2024-07-01
creator: ISPRA02
rights holder: Istituto Superiore per la Protezione e la Ricerca Ambientale
version info: 1.0
language: ITA
language: ENG
theme: ge
theme: lu
keyword: geologia
keyword: GeoSciencesIR @en
keyword: Gestione del territorio
keyword: Geomorfologia
keyword: Sistema informativo
keyword: Geomorphology@en
accrual periodicity: IRREG
distribution: geosites-geographicPositions-RDF-TURTLE
type: CodeList
contact point: ISPRA02
number of levels: 1
key concept: geographicPositions
conforms to: SKOS
representation technique: SKOS
creator: Elisa Brustia (ORCID: 0009-0001-5893-7651)
creator: Marina Funaro
creator: Mauro Lucarini (ORCID: 0000-0001-8730-7221)
creator: Luca Olivetta
creator: Roberto Pompili (ORCID: 0000-0003-3001-7295)
creator: Paolo Primerano (ORCID: 0000-0001-9362-766X)
creator: Paolo Lino Manganello (ORCID: 0009-0008-5129-4391)
creator: Maria Pia Congi (ORCID: 0000-0002-9330-9554)
creator: Carlo Cipolloni (ORCID: 0000-0001-7652-9814)
creator: Elio Giulianelli (ORCID: 0000-0003-0998-9751)
comment: Prodotto nel progetto PNRR GeoSciences IR - per l'armonizzazione dei termini del database Inventario Nazionale dei Geositi
comment: Produced within the PNRR GeoSciences IR project - for the harmonization of the terms in the National Inventory of Geosites database. @en
publisher: Istituto Superiore per la Protezione e la Ricerca Ambientale
has top concept: Emerso epigeo
has top concept: Emerso ipogeo
has top concept: Emerso epigeo e ipogeo
has top concept: Parzialmente emerso o sommerso ipogeo
has top concept: Parzialmente emerso o sommerso epigeo
has top concept: Sommerso epigeo e ipogeo visibile da superficie
has top concept: Sommerso epigeo visibile in immersione

Istituto Superiore per la Protezione e la Ricerca Ambientale
type: NamedIndividual
type: Agent
type: Organization
type: Organosation
fn: Istituto Superiore per la Protezione e la Ricerca Ambientale

Distribuzione RDF/Turtle del vocabolario controllato GeoSciencesIR per tipologia di posizione del geositi.
type: Distribution
format: RDF TURTLE
license: A21 CCBY40
title: RDF/Turtle distribution of the GeoSciencesIR controlled vocabulary by geosite location type. @en
description: Questa è la Distribuzione RDF/Turtle del vocabolario controllato GeoSciencesIR per tipologia di posizione del geositi.
description: This is the RDF/Turtle distribution of the GeoSciencesIR controlled vocabulary by geosite location type. @en
access URL: https://github.com/isprambiente/dati-semantic/tree/main/assets/controlled-vocabularies/geosites/geographicPositions
download URL: https://raw.githubusercontent.com/isprambiente/dati-semantic/main/assets/controlled-vocabularies/geosites/geographicPositions/geographicPositions.ttl

ISPRA02
type: NamedIndividual
type: Organization
type: Kind
fn: Unità ISPRA 02 del progetto GeoSciencesIR (Research Infrastructure)
fn: GeoSciencesIR (Research Infrastructure) project Unit ISPRA 02 @en

Emerso epigeo
type: Concept
definition: point on a continent or island that is above sea level and above ground @en
definition: punto di un continente o un'isola che si trova al disopra del livello del mare e fuori del terreno
preferred label: Emerged epigean @en
notation: 1
top concept of: Vocabulary of geographical position aspects of geosite.
in scheme: Vocabulary of geographical position aspects of geosite.

Emerso ipogeo
type: Concept
definition: point on a continent or island that is above sea level and below the surface of the ground @en
definition: punto di un continente o un'isola che si trova al disopra del livello del mare e sotto la superficie del suolo
preferred label: Emerged underground @en
notation: 2
top concept of: Vocabulary of geographical position aspects of geosite.
in scheme: Vocabulary of geographical position aspects of geosite.

Emerso epigeo e ipogeo
type: Concept
definition: point on a continent or island that is above sea level, below and above ground @en
definition: punto di un continente o un'isola che si trova al disopra del livello del mare, fuori del terreno e sotto la superficie del suolo
preferred label: Emerged epigean and hypogeal @en
notation: 3
top concept of: Vocabulary of geographical position aspects of geosite.
in scheme: Vocabulary of geographical position aspects of geosite.

Parzialmente emerso o sommerso ipogeo
type: Concept
definition: point on a continent or island that is partially above or below sea level and below the surface of the ground @en
definition: punto su un continente o un'isola che si trova parzialmente sopra o sotto il livello del mare e sotto la superficie del suolo
preferred label: Partially emerged or submerged @en
notation: 4
top concept of: Vocabulary of geographical position aspects of geosite.
in scheme: Vocabulary of geographical position aspects of geosite.

Parzialmente emerso o sommerso epigeo
type: Concept
definition: point on a continent or island that is partially above or below sea level and above ground @en
definition: punto su un continente o un'isola che si trova parzialmente sopra o sotto il livello del mare e fuori del terreno
preferred label: Partially emerged or submerged epigean @en
notation: 5
top concept of: Vocabulary of geographical position aspects of geosite.
in scheme: Vocabulary of geographical position aspects of geosite.

Sommerso epigeo e ipogeo visibile da superficie
type: Concept
definition: point on a continent or in the sea that is below sea level. below and above ground, and visible from surface @en
definition: punto su un continente o in mare che si trova sotto il livello del mare, fuori del terreno e sotto la superficie del suolo, ed è visibile dalla superficie
preferred label: Submerged epigeal and hypogeal visible from the surface @en
notation: 6
top concept of: Vocabulary of geographical position aspects of geosite.
in scheme: Vocabulary of geographical position aspects of geosite.

Sommerso epigeo visibile in immersione
type: Concept
definition: point on a continent or in the sea that is above sea level and visible underwater @en
definition: punto su un continente o in mare che si trova sotto il livello del mare ed è visibile in immersione
preferred label: Submerged epigean visible when immersed @en
notation: 7
top concept of: Vocabulary of geographical position aspects of geosite.
in scheme: Vocabulary of geographical position aspects of geosite.