Vocabolario dei temi di contesto dei geositi.
type: ConceptScheme
type: Dataset
type: Asset
title: Vocabulary of geosite context themes. @en
description: Vocabulary terms are a list of contextual themes that describe the characteristics of the geosite. @en
description: I termini del vocabolario sono una lista di temi contestuali che descrivono le caratteristiche del geosito.
issued: 2024-07-01
modified: 2024-07-01
creator: ISPRA02
rights holder: Istituto Superiore per la Protezione e la Ricerca Ambientale
version info: 1.0
language: ITA
language: ENG
theme: ge
theme: lu
keyword: Geologia
keyword: GeoSciencesIR @en
keyword: Gestione del territorio
keyword: Geomorfologia
keyword: Sistema informativo
keyword: Geomorphology @en
accrual periodicity: IRREG
distribution: geosites-contextualThemes-RDF-TURTLE
type: CodeList
contact point: ISPRA02
number of levels: 1
key concept: contextualThemes
conforms to: SKOS
representation technique: SKOS
creator: Elisa Brustia (ORCID: 0009-0001-5893-7651)
creator: Marina Funaro
creator: Mauro Lucarini (ORCID: 0000-0001-8730-7221)
creator: Luca Olivetta
creator: Roberto Pompili (ORCID: 0000-0003-3001-7295)
creator: Paolo Primerano (ORCID: 0000-0001-9362-766X)
creator: Paolo Lino Manganello (ORCID: 0009-0008-5129-4391)
creator: Maria Pia Congi (ORCID: 0000-0002-9330-9554)
creator: Carlo Cipolloni (ORCID: 0000-0001-7652-9814)
creator: Elio Giulianelli (ORCID: 0000-0003-0998-9751)
comment: Processo specifico per l'armonizzazione del database Inventario Nazionale dei Geositi di ISPRA.
comment: Specific process for the harmonization of the ISPRA National Inventory of Geosites database. @en
publisher: Istituto Superiore per la Protezione e la Ricerca Ambientale
has top concept: archeologia
has top concept: architettura
has top concept: botanica
has top concept: culturale
has top concept: didattica
has top concept: escursionismo
has top concept: storia
has top concept: paesaggistico
has top concept: naturalistico
has top concept: turismo
has top concept: biodiversità

Istituto Superiore per la Protezione e la Ricerca Ambientale
type: NamedIndividual
type: Agent
type: Organization
type: Organosation
fn: Istituto Superiore per la Protezione e la Ricerca Ambientale

Distribuzione RDF/Turtle del vocabolario controllato GeoSciencesIR per i temi di contesto associati al geosito.
type: Distribution
format: RDF TURTLE
license: A21 CCBY40
title: RDF/Turtle distribution of the GeoSciencesIR controlled vocabulary for the context themes associated with the geosite. @en
description: Questa è la Distribuzione RDF/Turtle del vocabolario controllato GeoSciencesIR per i temi di contesto associati al geosito.
description: This is the RDF/Turtle distribution of the GeoSciencesIR controlled vocabulary for the context themes associated with the geosite. @en
access URL: https://github.com/isprambiente/dati-semantic/tree/main/assets/controlled-vocabularies/geosites/contextualThemes
download URL: https://raw.githubusercontent.com/isprambiente/dati-semantic/main/assets/controlled-vocabularies/geosites/contextualThemes/contextualThemes.ttl

ISPRA02
type: NamedIndividual
type: Organization
type: Kind
fn: Unità ISPRA 02 del progetto GeoSciencesIR (Research Infrastructure)
fn: GeoSciencesIR (Research Infrastructure) project Unit ISPRA 02 @en

archeologia
type: Concept
definition: Discipline that deals with the study of ancient civilizations through the traces of their respective cultures (especially monuments and artistic products) @en
definition: Disciplina che si occupa dello studio delle civiltà antiche attraverso le tracce delle rispettive culture (spec. di monumenti e prodotti artistici)
preferred label: Archaeology @en
notation: 1
top concept of: Vocabolario dei temi di contesto dei geositi.
in scheme: Vocabolario dei temi di contesto dei geositi.
bibliographic citation: https://www.treccani.it/enciclopedia/archeologia/

architettura
type: Concept
definition: discipline whose aim is the organization of the anthropized space in which human beings live @en
definition: disciplina che ha come scopo l'organizzazione dello spazio antropizzato in cui vive l'essere umano
preferred label: Architecture @en
notation: 2
top concept of: Vocabolario dei temi di contesto dei geositi.
in scheme: Vocabolario dei temi di contesto dei geositi.
bibliographic citation: https://www.treccani.it/vocabolario/architettura/

botanica
type: Concept
preferred label: Botanic @en
notation: 3
top concept of: Vocabolario dei temi di contesto dei geositi.
in scheme: Vocabolario dei temi di contesto dei geositi.

culturale
type: Concept
definition: the knowledge relating to a particular discipline @en
definition: l’insieme delle conoscenze relative a una particolare disciplina
preferred label: Cultural @en
notation: 4
top concept of: Vocabolario dei temi di contesto dei geositi.
in scheme: Vocabolario dei temi di contesto dei geositi.
bibliographic citation: https://www.treccani.it/vocabolario/cultura/

didattica
type: Concept
preferred label: Educational @en
notation: 5
top concept of: Vocabolario dei temi di contesto dei geositi.
in scheme: Vocabolario dei temi di contesto dei geositi.

escursionismo
type: Concept
definition: Activity carried out for recreational purposes and to promote physical and cultural development @en
definition: Attività esercitata a scopo ricreativo e per promuovere lo sviluppo fisico e culturale
preferred label: Escursionistic @en
notation: 6
top concept of: Vocabolario dei temi di contesto dei geositi.
in scheme: Vocabolario dei temi di contesto dei geositi.
bibliographic citation: https://www.treccani.it/enciclopedia/escursionismo/

storia
type: Concept
definition: discipline about the study of the past through the use of documents, testimonies and stories @en
definition: disciplina che si occupa dello studio del passato tramite l'uso di fonti, documenti, testimonianze e racconti
preferred label: History @en
notation: 7
top concept of: Vocabolario dei temi di contesto dei geositi.
in scheme: Vocabolario dei temi di contesto dei geositi.
bibliographic citation: https://www.treccani.it/enciclopedia/storia/

paesaggistico
type: Concept
preferred label: Landscape @en
notation: 8
top concept of: Vocabolario dei temi di contesto dei geositi.
in scheme: Vocabolario dei temi di contesto dei geositi.

naturalistico
type: Concept
preferred label: Naturalistic @en
notation: 9
top concept of: Vocabolario dei temi di contesto dei geositi.
in scheme: Vocabolario dei temi di contesto dei geositi.

turismo
type: Concept
definition: activities and services outside the habitual residence @en
definition: attività e di servizi relativi a viaggi e soggiorni compiuti fuori dalla propria residenza abituale
preferred label: Tourism @en
notation: 10
top concept of: Vocabolario dei temi di contesto dei geositi.
in scheme: Vocabolario dei temi di contesto dei geositi.
bibliographic citation: https://www.treccani.it/enciclopedia/turismo/

biodiversità
type: Concept
preferred label: Wildlife @en
notation: 11
top concept of: Vocabolario dei temi di contesto dei geositi.
in scheme: Vocabolario dei temi di contesto dei geositi.