Vocabolario della dimensioni granulometriche.
type: ConceptScheme
type: Dataset
type: Asset
title: Grain size vocabulary. @en
description: The terms describe the grain size classes of the constituents of a rock/formation. @en
description: I termini descrivono le classi delle dimensioni granulometriche dei costituenti di una roccia/formazione.
issued: 2024-09-20
modified: 2024-09-20
creator: ISPRA06
rights holder: Istituto Superiore per la Protezione e la Ricerca Ambientale
version info: 1.0
language: ITA
language: ENG
theme: ge
keyword: Sedimentario
keyword: GeoSciencesIR @en
keyword: Granulometria
keyword: Geologia
keyword: Sedimentary @en
keyword: Grain size @en
accrual periodicity: IRREG
distribution: geo-sedimentGrainSizes-RDF-TURTLE
type: Taxonomy
contact point: ISPRA06
number of levels: 3
key concept: sedimentGrainSizes
conforms to: SKOS
representation technique: SKOS
creator: Maurizio Marino (ORCID: 0000-0002-6425-2253)
creator: Angelo Cipriani (ORCID: 0000-0002-3971-3177)
creator: Paolo Lino Manganello (ORCID: 0009-0008-5129-4391)
creator: Mariapia Congi (ORCID: 0000-0002-9330-9554)
creator: Carlo Cipolloni (ORCID: 0000-0001-7652-9814)
creator: Elio Giulianelli (ORCID: 0000-0003-0998-9751)
comment: Il vocabolario è stato prodotto dal gruppo di stratigrafia di ISPRA prendendo in considerazione quanto già in essere in INSPIRE e IUGS-CGI.
comment: The vocabulary was developed by ISPRA's stratigraphy group, in alignment with existing INSPIRE and IUGS-CGI frameworks. @en
publisher: Istituto Superiore per la Protezione e la Ricerca Ambientale
has top concept: Ghiaia
has top concept: Sabbia
has top concept: Fango

Istituto Superiore per la Protezione e la Ricerca Ambientale
type: NamedIndividual
type: Agent
type: Organization
type: Organisation
fn: Istituto Superiore per la Protezione e la Ricerca Ambientale

Distribuzione RDF/Turtle del vocabolario controllato GeoSciencesIR per le classi granulometriche dei costituenti di una roccia.
type: Distribution
format: RDF TURTLE
license: A21 CCBY40
title: RDF/Turtle distribution of the GeoSciencesIR controlled vocabulary for the grain size classes of rock constituents. @en
description: Questa è la Distribuzione RDF/Turtle del vocabolario controllato GeoSciencesIR per le classi granulometriche dei costituenti di una roccia.
description: This is the RDF/Turtle distribution of the GeoSciencesIR controlled vocabulary for the grain size classes of rock constituents. @en
access URL: https://github.com/isprambiente/dati-semantic/tree/main/assets/controlled-vocabularies/geo/sedimentGrainSizes
download URL: https://raw.githubusercontent.com/isprambiente/dati-semantic/main/assets/controlled-vocabularies/geo/sedimentGrainSizes/sedimentGrainSizes.ttl

ISPRA06
type: NamedIndividual
type: Organization
type: Kind
fn: Unità ISPRA 6 del progetto GeoSciencesIR (Research Infrastructure)
fn: GeoSciencesIR (Research Infrastructure) project Unit ISPRA 6 @en

Ghiaia
type: Concept
definition: Sediment containing greater than 30 percent gravel-size particles (greater than 2.0 mm diameter). Composition or gensis of clasts not specified. @en
definition: Sedimento contenente più del 30 percento di particelle di dimensioni della ghiaia (diametro maggiore di 2,0 mm). Composizione o genesi dei clasti non specificata.
preferred label: Gravel @en
notation: 1
top concept of: Vocabolario della dimensioni granulometriche.
in scheme: Vocabolario della dimensioni granulometriche.
narrower: Blocco
narrower: Ciottolo
narrower: Granulo e ciottoletto

Blocco
type: Concept
definition: Sediment containing greater than 30 percent boulder-size particles (greater than 256 mm in diameter) @en
definition: Sedimento contenente più del 30 percento di particelle di dimensioni del blocco (diametro superiore a 256 mm)
preferred label: Boulder gravel @en
notation: 1.1
in scheme: Vocabolario della dimensioni granulometriche.
broader: Ghiaia

Ciottolo
type: Concept
definition: Sediment containing greater than 30 percent cobble-size particles (64-256 mm in diameter) @en
definition: Sedimento contenente più del 30 percento di particelle delle dimensioni del ciottolo (diametro 64-256 mm)
preferred label: Cobble gravel @en
notation: 1.2
in scheme: Vocabolario della dimensioni granulometriche.
broader: Ghiaia

Granulo e ciottoletto
type: Concept
definition: Sediment containing greater than 30 percent pebble-size particles (2.0 -64 mm in diameter) @en
definition: Sedimento contenente più del 30 percento di particelle di dimensioni del granuolo e del ciottoletto (2-64 mm di diametro)
preferred label: Pebble gravel @en
notation: 1.3
in scheme: Vocabolario della dimensioni granulometriche.
bibliographic citation: (Bosellini et al., 1989)
broader: Ghiaia

Sabbia
type: Concept
definition: Sediment in which less than 30 percent of particles are gravel (greater than 2 mm in diameter) and the sand to mud ratio is at least 1. Composition or genesis of clasts not specified. @en
definition: Sedimento in cui meno del 30 percento delle particelle è costituito da ghiaia (diametro superiore a 2 mm) e il rapporto sabbia/fango è almeno pari a 1. Composizione o genesi dei clasti non specificata.
preferred label: Sand @en
notation: 2
top concept of: Vocabolario della dimensioni granulometriche.
in scheme: Vocabolario della dimensioni granulometriche.
narrower: Sabbia molto fine
narrower: Sabbia fine
narrower: Sabbia media
narrower: Sabbia grossolana
narrower: Sabbia molto grossolana

Sabbia molto fine
type: Concept
definition: Sediment in which less than 30 percent of particles are gravel (greater than 2 mm in diameter) and the sand to mud ratio is at least 1. Composition or genesis of clasts not specified. More than 50% of the sand particles are between 0.0625 (1/16) mm and 0.125 (1/8) mm in size (Wentworth, 1922) @en
definition: Sedimento in cui meno del 30 percento delle particelle è costituito da ghiaia (diametro superiore a 2 mm) e il rapporto sabbia/fango è almeno pari a 1. Composizione o genesi dei clasti non specificata. Più del 50 % delle particelle sabbiose hanno dimensione compresa tra i 0,0625 (1/16) mm e i 0,125 (1/8) mm (Wentworth, 1922)
preferred label: Very fine sand @en
notation: 2.1
in scheme: Vocabolario della dimensioni granulometriche.
bibliographic citation: Wentworth, C. K. (1922). A scale of grade and class terms for clastic sediments. The journal of geology, 30(5), 377-392.
broader: Sabbia

Sabbia fine
type: Concept
definition: Sediment in which less than 30 percent of particles are gravel (greater than 2 mm in diameter) and the sand to mud ratio is at least 1. Composition or genesis of clasts not specified. More than 50% of the sand particles are between 0.125 (1/8) mm and 0.25 (1/4) mm in size (Wentworth, 1922) @en
definition: Sedimento in cui meno del 30 percento delle particelle è costituito da ghiaia (diametro superiore a 2 mm) e il rapporto sabbia/fango è almeno pari a 1. Composizione o genesi dei clasti non specificata. Più del 50 % delle particelle sabbiose hanno dimensione compresa tra i 0,125 (1/8) mm e i 0,25 (1/4) mm (Wentworth, 1922)
preferred label: Fine sand @en
notation: 2.2
in scheme: Vocabolario della dimensioni granulometriche.
bibliographic citation: Wentworth, C. K. (1922). A scale of grade and class terms for clastic sediments. The journal of geology, 30(5), 377-392.
broader: Sabbia

Sabbia media
type: Concept
definition: Sediment in which less than 30 percent of particles are gravel (greater than 2 mm in diameter) and the sand to mud ratio is at least 1. Composition or genesis of clasts not specified. More than 50% of the sand particles are between 0.25 (1/4) mm and 0.5 (1/2) mm in size (Wentworth, 1922) @en
definition: Sedimento in cui meno del 30 percento delle particelle è costituito da ghiaia (diametro superiore a 2 mm) e il rapporto sabbia/fango è almeno pari a 1. Composizione o genesi dei clasti non specificata. Più del 50 % delle particelle sabbiose hanno dimensione compresa tra i 0,25 (1/4) mm e i 0,5 (1/2) mm (Wentworth, 1922)
preferred label: Medium sand @en
notation: 2.3
in scheme: Vocabolario della dimensioni granulometriche.
bibliographic citation: Wentworth, C. K. (1922). A scale of grade and class terms for clastic sediments. The journal of geology, 30(5), 377-392.
broader: Sabbia

Sabbia grossolana
type: Concept
definition: Sediment in which less than 30 percent of particles are gravel (greater than 2 mm in diameter) and the sand to mud ratio is at least 1. Composition or genesis of clasts not specified. More than 50% of the sand particles are between 0.5 (1/2) mm and 1 mm in size (Wentworth, 1922) @en
definition: Sedimento in cui meno del 30 percento delle particelle è costituito da ghiaia (diametro superiore a 2 mm) e il rapporto sabbia/fango è almeno pari a 1. Composizione o genesi dei clasti non specificata.Più del 50 % delle particelle sabbiose hanno dimensione compresa tra i 0,5 (1/2) mm e 1 mm (Wentworth, 1922)
preferred label: Coarse sand @en
notation: 2.4
in scheme: Vocabolario della dimensioni granulometriche.
bibliographic citation: Wentworth, C. K. (1922). A scale of grade and class terms for clastic sediments. The journal of geology, 30(5), 377-392.
broader: Sabbia

Sabbia molto grossolana
type: Concept
definition: Sediment in which less than 30 percent of particles are gravel (greater than 2 mm in diameter) and the sand to mud ratio is at least 1. Composition or genesis of clasts not specified. More than 50% of the sand particles are between 1 mm and 2 mm in size (Wentworth, 1922) @en
definition: Sedimento in cui meno del 30 percento delle particelle è costituito da ghiaia (diametro superiore a 2 mm) e il rapporto sabbia/fango è almeno pari a 1. Composizione o genesi dei clasti non specificata. Più del 50 % delle particelle sabbiose hanno dimensione compresa tra 1 mm e 2 mm (Wentworth, 1922)
preferred label: Very coarse sand @en
notation: 2.5
in scheme: Vocabolario della dimensioni granulometriche.
bibliographic citation: Wentworth, C. K. (1922). A scale of grade and class terms for clastic sediments. The journal of geology, 30(5), 377-392.
broader: Sabbia

Fango
type: Concept
definition: Sediment consisting of less than 30 percent gravel-size (2 mm) particles and with a mud-size to sand-size particle ratio greater than 1. Clasts may be of any composition or origin. @en
definition: Sedimento costituito da meno del 30 percento di particelle di dimensioni della ghiaia (2 mm) e con un rapporto tra particelle di dimensioni del fango (silt e/o argilla) e particelle di dimensioni della sabbia maggiore di 1. I clasti possono essere di qualsiasi composizione o origine.
preferred label: Mud @en
notation: 3
top concept of: Vocabolario della dimensioni granulometriche.
in scheme: Vocabolario della dimensioni granulometriche.
narrower: Silt
narrower: Argilla

Silt
type: Concept
definition: Sediment consisting of less than 30 percent gravel-size (2 mm) particles and with a mud-size to sand-size particle ratio greater than 1. Clasts may be of any composition or origin. More than 50% of mud particles are between 62.5 and 3.9 microns in size (Wentworth, 1922) @en
definition: Sedimento costituito da meno del 30 percento di particelle di dimensioni della ghiaia (2 mm) e con un rapporto tra particelle di dimensioni del fango (silt e/o argilla) e particelle di dimensioni della sabbia maggiore di 1. I clasti possono essere di qualsiasi composizione o origine. Più del 50% delle particelle fangose hanno dimensione compresa tra 62,5 e 3,9 micron (Wentworth, 1922)
alternative label: Limo-silt, limo
notation: 3.1
in scheme: Vocabolario della dimensioni granulometriche.
bibliographic citation: Wentworth, C. K. (1922). A scale of grade and class terms for clastic sediments. The journal of geology, 30(5), 377-392.
broader: Fango
narrower: Silt molto fine
narrower: Silt fine
narrower: Silt medio
narrower: Silt grossolano

Silt molto fine
type: Concept
definition: Sediment consisting of less than 30 percent gravel-size (2 mm) particles and with a mud-size to sand-size particle ratio greater than 1. Clasts may be of any composition or origin. More than 50% of mud particles are between 3.9 and 7.8 microns in size (Wentworth, 1922) @en
definition: Sedimento costituito da meno del 30 percento di particelle di dimensioni della ghiaia (2 mm) e con un rapporto tra particelle di dimensioni del fango (silt e/o argilla) e particelle di dimensioni della sabbia maggiore di 1. I clasti possono essere di qualsiasi composizione o origine. Più del 50% delle particelle fangose hanno dimensione compresa tra 3,9 e 7,8 micron (Wentworth, 1922)
preferred label: Very fine silt @en
notation: 3.1.1
in scheme: Vocabolario della dimensioni granulometriche.
bibliographic citation: Wentworth, C. K. (1922). A scale of grade and class terms for clastic sediments. The journal of geology, 30(5), 377-392.
broader: Silt

Silt fine
type: Concept
definition: Sediment consisting of less than 30 percent gravel-size (2 mm) particles and with a mud-size to sand-size particle ratio greater than 1. Clasts may be of any composition or origin. More than 50% of mud particles are between 7.8 and 15.6 microns in size (Wentworth, 1922) @en
definition: Sedimento costituito da meno del 30 percento di particelle di dimensioni della ghiaia (2 mm) e con un rapporto tra particelle di dimensioni del fango (silt e/o argilla) e particelle di dimensioni della sabbia maggiore di 1. I clasti possono essere di qualsiasi composizione o origine. Più del 50% delle particelle fangose hanno dimensione compresa tra 7,8 e 15,6 micron (Wentworth, 1922)
preferred label: Fine silt @en
notation: 3.1.2
in scheme: Vocabolario della dimensioni granulometriche.
bibliographic citation: Wentworth, C. K. (1922). A scale of grade and class terms for clastic sediments. The journal of geology, 30(5), 377-392.
broader: Silt

Silt medio
type: Concept
definition: Sediment consisting of less than 30 percent gravel-size (2 mm) particles and with a mud-size to sand-size particle ratio greater than 1. Clasts may be of any composition or origin. More than 50% of mud particles are between 15.6 and 31 microns in size (Wentworth, 1922) @en
definition: Sedimento costituito da meno del 30 percento di particelle di dimensioni della ghiaia (2 mm) e con un rapporto tra particelle di dimensioni del fango (silt e/o argilla) e particelle di dimensioni della sabbia maggiore di 1. I clasti possono essere di qualsiasi composizione o origine. Più del 50% delle particelle fangose hanno dimensione compresa tra 15,6 e 31 micron (Wentworth, 1922)
preferred label: Medium silt @en
notation: 3.1.3
in scheme: Vocabolario della dimensioni granulometriche.
bibliographic citation: Wentworth, C. K. (1922). A scale of grade and class terms for clastic sediments. The journal of geology, 30(5), 377-392.
broader: Silt

Silt grossolano
type: Concept
definition: Sediment consisting of less than 30 percent gravel-size (2 mm) particles and with a mud-size to sand-size particle ratio greater than 1. Clasts may be of any composition or origin. More than 50% of mud particles are between 31 and 62.5 microns in size (Wentworth, 1922) @en
definition: Sedimento costituito da meno del 30 percento di particelle di dimensioni della ghiaia (2 mm) e con un rapporto tra particelle di dimensioni del fango (silt e/o argilla) e particelle di dimensioni della sabbia maggiore di 1. I clasti possono essere di qualsiasi composizione o origine. Più del 50% delle particelle fangose hanno dimensione compresa tra 31 e 62,5 micron (Wentworth, 1922)
preferred label: Coarse silt @en
notation: 3.1.4
in scheme: Vocabolario della dimensioni granulometriche.
bibliographic citation: Wentworth, C. K. (1922). A scale of grade and class terms for clastic sediments. The journal of geology, 30(5), 377-392.
broader: Silt

Argilla
type: Concept
definition: Sediment consisting of less than 30 percent gravel-size (2 mm) particles and with a mud-size to sand-size particle ratio greater than 1. Clasts may be of any composition or origin. More than 50% of the mud particles are smaller than 3.9 microns (Wentworth, 1922) @en
definition: Sedimento costituito da meno del 30 percento di particelle di dimensioni della ghiaia (2 mm) e con un rapporto tra particelle di dimensioni del fango (silt e/o argilla) e particelle di dimensioni della sabbia maggiore di 1. I clasti possono essere di qualsiasi composizione o origine. Più del 50% delle particelle fangose hanno dimensione inferiore ai 3,9 micron (Wentworth, 1922)
preferred label: Clay @en
notation: 3.2
in scheme: Vocabolario della dimensioni granulometriche.
bibliographic citation: Wentworth, C. K. (1922). A scale of grade and class terms for clastic sediments. The journal of geology, 30(5), 377-392.
broader: Fango