Vocabolario dei termini delle risorse minerarie.
type: ConceptScheme
type: Dataset
type: Asset
title: Vocabulary of mineral resource terms. @en
description: The terms represent the classes of mineral resource points of the CARG geological mapping. @en
description: I termini rappresentano le classi di punti delle risorse minerarie della cartografia geologica CARG.
issued: 2024-09-28
modified: 2024-09-28
creator: ISPRA03
rights holder: Istituto Superiore per la Protezione e la Ricerca Ambientale
version info: 1.0
language: ITA
language: ENG
theme: ge
theme: mr
keyword: Geologia
keyword: GeoSciencesIR @en
keyword: Gestione del suolo
keyword: Risorse naturali
keyword: Mineral resources @en
keyword: Geologic @en
accrual periodicity: IRREG
distribution: geo-observationSites-RDF-TURTLE
type: CodeList
contact point: ISPRA03
number of levels: 1
key concept: resourcesObservations
conforms to: SKOS
representation technique: SKOS
creator: Roberta Carta
creator: Loredana Battaglini
creator: Francesco Clemente
creator: Petricca Patrizio (ORCID: 0000-0003-1186-4296)
creator: Lorenzo Pistocchi
creator: Paolo Lino Manganello
creator: Maria Pia Congi (ORCID: 0000-0002-9330-9554)
creator: Carlo Cipolloni (ORCID: 0000-0001-7652-9814)
creator: Elio Giulianelli (ORCID: 0000-0003-0998-9751)
comment: Standardizzazione dei termini e dei parametri utilizzati nelle codelist durante il processo di armonizzazione verso INSPIRE/CGI dei parametri del progetto di carta geologica CARG.
comment: Standardization of terms and parameters used in codelists during the process of harmonization with INSPIRE/CGI of the CARG geological map project parameters. @en
publisher: Istituto Superiore per la Protezione e la Ricerca Ambientale
has top concept: Cava attiva
has top concept: Cava inattiva
has top concept: Cava adibita a discarica
has top concept: Cava riempita
has top concept: Saggio di cava
has top concept: Miniera attiva
has top concept: Miniera inattiva
has top concept: Sorgente
has top concept: Sorgente minerale
has top concept: Sorgente termominerale
has top concept: Manifestazione di vapore
has top concept: Manifestazione di idrocarburi
has top concept: Emanazione gassosa, mofete
has top concept: Emanazione gassosa fredda
has top concept: Emanazione gassosa ad alta temperatura, fumarole
has top concept: Pozzo per acqua
has top concept: Pozzo per acqua minerale
has top concept: Pozzo per acqua termominerale
has top concept: Pozzo per idrocarburi liquidi
has top concept: Pozzo per idrocarburi gassosi
has top concept: Pozzo per ricerca mineraria
has top concept: Sondaggio esplorativo
has top concept: Songaggio geognostico CARG
has top concept: Sondaggio per ricerca di idrocarburi
has top concept: Sondaggio per ricerca di geotermica
has top concept: Sondaggio per ricerca mineraria
has top concept: Manifestazioni di interesse minerario
has top concept: Area interessata da sondaggi per ricerca mineraria
has top concept: Prove penetrometriche
has top concept: Prove penetrometriche dinamiche
has top concept: Prove penetrometriche statiche
has top concept: Trivellazione manuale
has top concept: Carotaggio
has top concept: Carotaggio a gravitá
has top concept: Vibrocarotaggio
has top concept: Dragaggio
has top concept: Bennata
has top concept: Box-core

Istituto Superiore per la Protezione e la Ricerca Ambientale
type: NamedIndividual
type: Agent
type: Organization
type: Organosation
fn: Istituto Superiore per la Protezione e la Ricerca Ambientale

Distribuzione RDF/Turtle del vocabolario controllato GeoSciencesIR per i tipi di risorse minerarie del progetto CARG.
type: Distribution
format: RDF TURTLE
license: A21 CCBY40
title: RDF/Turtle distribution of the GeoSciencesIR controlled vocabulary for the outcrop types of geological interest of the CARG project. @en
description: Questa è la Distribuzione RDF/Turtle del vocabolario controllato GeoSciencesIR per i tipi di risorse minerarie del progetto CARG.
description: This is the RDF/Turtle distribution of the GeoSciencesIR controlled vocabulary for the outcrop types of geological interest of the CARG project. @en
access URL: https://github.com/isprambiente/dati-semantic/tree/main/assets/controlled-vocabularies/geo/resourcesObservations
download URL: https://raw.githubusercontent.com/isprambiente/dati-semantic/main/assets/controlled-vocabularies/geo/resourcesObservations/resourcesObservations.ttl

ISPRA03
type: NamedIndividual
type: Organization
type: Kind
fn: Unità ISPRA 03 del progetto GeoSciencesIR (Research Infrastructure)
fn: GeoSciencesIR (Research Infrastructure) project Unit ISPRA 03 @en

Cava attiva
type: Concept
definition: Quarry with cultivation activities currently underway @en
definition: Cava con attività di coltivazione attualmente in atto
preferred label: Active quarry @en
notation: 1
top concept of: Vocabolario dei termini delle risorse minerarie.
in scheme: Vocabolario dei termini delle risorse minerarie.
bibliographic citation: Artioli G.P. et al. 1997 - Carta Geologica d’Italia 1:50.000 Banca dati geologici: Linee guida per l’informatizzazione e per l’allestimento per la stampa dalla banca dati, I Quaderni, serie III, del SGI Volume 6/1997 (Ed. 2008).

Cava inattiva
type: Concept
definition: Quarry used in the past and no longer active @en
definition: Cava utilizzata in passato e non più attiva
preferred label: Inactive quarry @en
notation: 2
top concept of: Vocabolario dei termini delle risorse minerarie.
in scheme: Vocabolario dei termini delle risorse minerarie.
bibliographic citation: Artioli G.P. et al. 1997 - Carta Geologica d’Italia 1:50.000 Banca dati geologici: Linee guida per l’informatizzazione e per l’allestimento per la stampa dalla banca dati, I Quaderni, serie III, del SGI Volume 6/1997 (Ed. 2008).

Cava adibita a discarica
type: Concept
definition: Quarry used in the past and no longer active, today used for waste disposal @en
definition: Cava utilizzata in passato e non più attiva, oggi destinata al conferimento dei rifiuti
preferred label: Quarry used as a landfill @en
notation: 3
top concept of: Vocabolario dei termini delle risorse minerarie.
in scheme: Vocabolario dei termini delle risorse minerarie.
bibliographic citation: Artioli G.P. et al. 1997 - Carta Geologica d’Italia 1:50.000 Banca dati geologici: Linee guida per l’informatizzazione e per l’allestimento per la stampa dalla banca dati, I Quaderni, serie III, del SGI Volume 6/1997 (Ed. 2008).

Cava riempita
type: Concept
definition: Quarry used in the past and no longer active, now filled following environmental restoration. @en
definition: Cava utilizzata in passato e non più attiva, oggi colmata a seguito di ripristino ambientale
preferred label: Filled quarry @en
notation: 4
top concept of: Vocabolario dei termini delle risorse minerarie.
in scheme: Vocabolario dei termini delle risorse minerarie.
bibliographic citation: Artioli G.P. et al. 1997 - Carta Geologica d’Italia 1:50.000 Banca dati geologici: Linee guida per l’informatizzazione e per l’allestimento per la stampa dalla banca dati, I Quaderni, serie III, del SGI Volume 6/1997 (Ed. 2008).

Saggio di cava
type: Concept
definition: Portion of territory subject to studies due to the presence of land which, due to its characteristics, could be the subject of cultivation (quarry) @en
definition: Porzione di territorio soggetta a studi per la presenza di terreni che, per le loro caratteristiche, potrebbero essere oggetto di coltivazione (cava)
preferred label: Quarry sample @en
notation: 5
top concept of: Vocabolario dei termini delle risorse minerarie.
in scheme: Vocabolario dei termini delle risorse minerarie.
bibliographic citation: Artioli G.P. et al. 1997 - Carta Geologica d’Italia 1:50.000 Banca dati geologici: Linee guida per l’informatizzazione e per l’allestimento per la stampa dalla banca dati, I Quaderni, serie III, del SGI Volume 6/1997 (Ed. 2008).

Miniera attiva
type: Concept
definition: Mine currently used for the extraction of materials due to the presence of minerals and rocks of depositological interest @en
definition: Miniera attualmente adibita all’estrazione di materiali per la presenza di minerali e rocce di interesse giacimentologico
preferred label: Active mine @en
notation: 6
top concept of: Vocabolario dei termini delle risorse minerarie.
in scheme: Vocabolario dei termini delle risorse minerarie.
bibliographic citation: Artioli G.P. et al. 1997 - Carta Geologica d’Italia 1:50.000 Banca dati geologici: Linee guida per l’informatizzazione e per l’allestimento per la stampa dalla banca dati, I Quaderni, serie III, del SGI Volume 6/1997 (Ed. 2008).

Miniera inattiva
type: Concept
definition: Mine once used for the extraction of materials due to the presence of minerals and rocks of depositological interest, but no longer used @en
definition: Miniera un tempo adibita all’estrazione di materiali per la presenza di minerali e rocce di interesse giacimentologico, ma oramai non più utilizzata
preferred label: Inactive mine @en
notation: 7
top concept of: Vocabolario dei termini delle risorse minerarie.
in scheme: Vocabolario dei termini delle risorse minerarie.
bibliographic citation: Artioli G.P. et al. 1997 - Carta Geologica d’Italia 1:50.000 Banca dati geologici: Linee guida per l’informatizzazione e per l’allestimento per la stampa dalla banca dati, I Quaderni, serie III, del SGI Volume 6/1997 (Ed. 2008).

Sorgente
type: Concept
definition: The point at which a flow of water flows naturally to the surface or into a body of surface water, where the aquifer intercepts the topographic surface @en
definition: Il punto in cui un flusso d’acqua scaturisce naturalmente in superficie o in un corpo d’acqua superficiale, dove la falda acquifera intercetta la superficie topografica
preferred label: Spring @en
notation: 8
top concept of: Vocabolario dei termini delle risorse minerarie.
in scheme: Vocabolario dei termini delle risorse minerarie.
bibliographic citation: Artioli G.P. et al. 1997 - Carta Geologica d’Italia 1:50.000 Banca dati geologici: Linee guida per l’informatizzazione e per l’allestimento per la stampa dalla banca dati, I Quaderni, serie III, del SGI Volume 6/1997 (Ed. 2008).

Sorgente minerale
type: Concept
definition: Source whose water has a dissolved salt content (expressed as fixed residue) >50 mg/l. In the reference range of fixed residue from 50 to 500 mg/l there are low-mineral waters, from 500 to 1500 mg/l medium-mineral waters, over 1500 mg/l waters rich in mineral salts @en
definition: Sorgente la cui acqua presenta un contenuto in sali disciolti (espresso come residuo fisso) >50 mg/l. Nell’intervallo di riferimento di residuo fisso da 50 a 500 mg/l si hanno le acque oligominerali, da 500 a 1500 mg/l le acque medio-minerali, oltre 1500 mg/l le acque ricche in sali minerali
preferred label: Mineral spring @en
notation: 9
top concept of: Vocabolario dei termini delle risorse minerarie.
in scheme: Vocabolario dei termini delle risorse minerarie.
bibliographic citation: Artioli G.P. et al. 1997 - Carta Geologica d’Italia 1:50.000 Banca dati geologici: Linee guida per l’informatizzazione e per l’allestimento per la stampa dalla banca dati, I Quaderni, serie III, del SGI Volume 6/1997 (Ed. 2008).

Sorgente termominerale
type: Concept
definition: Mineral spring whose water has a temperature more than 10°C higher than the annual average air temperature of the area, or has a water temperature above 20°C @en
definition: Sorgente minerale la cui acqua ha una temperatura di oltre 10°C più elevata della media annuale della temperatura dell’aria della zona, oppure ha una temperatura dell’acqua superiore ai 20°C
preferred label: Termomineral spring @en
notation: 10
top concept of: Vocabolario dei termini delle risorse minerarie.
in scheme: Vocabolario dei termini delle risorse minerarie.
bibliographic citation: Artioli G.P. et al. 1997 - Carta Geologica d’Italia 1:50.000 Banca dati geologici: Linee guida per l’informatizzazione e per l’allestimento per la stampa dalla banca dati, I Quaderni, serie III, del SGI Volume 6/1997 (Ed. 2008).

Manifestazione di vapore
type: Concept
definition: Mineral spring whose water has a temperature more than 10°C higher than the annual average air temperature of the area, or has a water temperature above 20°C @en
definition: Sorgente minerale la cui acqua ha una temperatura di oltre 10°C più elevata della media annuale della temperatura dell’aria della zona, oppure ha una temperatura dell’acqua superiore ai 20°C
preferred label: Steam manifestation @en
notation: 11
top concept of: Vocabolario dei termini delle risorse minerarie.
in scheme: Vocabolario dei termini delle risorse minerarie.
bibliographic citation: Artioli G.P. et al. 1997 - Carta Geologica d’Italia 1:50.000 Banca dati geologici: Linee guida per l’informatizzazione e per l’allestimento per la stampa dalla banca dati, I Quaderni, serie III, del SGI Volume 6/1997 (Ed. 2008).

Manifestazione di idrocarburi
type: Concept
definition: Coming to the surface of liquid, solid or gaseous hydrocarbons @en
definition: Venuta in superficie di idrocarburi liquidi, solidi o gassosi
preferred label: Manifestation of hydrocarbons @en
notation: 12
top concept of: Vocabolario dei termini delle risorse minerarie.
in scheme: Vocabolario dei termini delle risorse minerarie.
bibliographic citation: Artioli G.P. et al. 1997 - Carta Geologica d’Italia 1:50.000 Banca dati geologici: Linee guida per l’informatizzazione e per l’allestimento per la stampa dalla banca dati, I Quaderni, serie III, del SGI Volume 6/1997 (Ed. 2008).

Emanazione gassosa, mofete
type: Concept
definition: Any occurrence of gas regardless of its nature and its temperature. In volcanic environment: carbon dioxide emission point generally associated with late volcanic manifestations @en
definition: Qualsiasi venuta a giorno di gas indipendentemente dalla natura di questo e dalla sua temperatura. In ambiente vulcanico: punto di emissione di anidride carbonica generalmente associato a manifestazioni tardovulcaniche
preferred label: Gaseous emanation, mophete @en
notation: 13
top concept of: Vocabolario dei termini delle risorse minerarie.
in scheme: Vocabolario dei termini delle risorse minerarie.
bibliographic citation: Artioli G.P. et al. 1997 - Carta Geologica d’Italia 1:50.000 Banca dati geologici: Linee guida per l’informatizzazione e per l’allestimento per la stampa dalla banca dati, I Quaderni, serie III, del SGI Volume 6/1997 (Ed. 2008).

Emanazione gassosa fredda
type: Concept
definition: Any coming to day of gas at room temperature; the term excludes any genetic connotation @en
definition: Qualsiasi venuta a giorno di gas a temperatura ambiente; il termine esclude ogni connotazione genetica
preferred label: Cold gaseous emanation @en
notation: 14
top concept of: Vocabolario dei termini delle risorse minerarie.
in scheme: Vocabolario dei termini delle risorse minerarie.
bibliographic citation: Artioli G.P. et al. 1997 - Carta Geologica d’Italia 1:50.000 Banca dati geologici: Linee guida per l’informatizzazione e per l’allestimento per la stampa dalla banca dati, I Quaderni, serie III, del SGI Volume 6/1997 (Ed. 2008).

Emanazione gassosa ad alta temperatura, fumarole
type: Concept
definition: Natural emissions of gaseous mixtures with a prevalence of water vapour @en
definition: Emissioni naturali di miscele aeriformi a prevalenza di vapore d’acqua
preferred label: High temperature gaseous emanation, fumaroles @en
notation: 15
top concept of: Vocabolario dei termini delle risorse minerarie.
in scheme: Vocabolario dei termini delle risorse minerarie.
bibliographic citation: Artioli G.P. et al. 1997 - Carta Geologica d’Italia 1:50.000 Banca dati geologici: Linee guida per l’informatizzazione e per l’allestimento per la stampa dalla banca dati, I Quaderni, serie III, del SGI Volume 6/1997 (Ed. 2008).

Pozzo per acqua
type: Concept
definition: Well constructed with the aim of intercepting one or more aquifers for the purpose of their exploitation @en
definition: Pozzo realizzato con lo scopo di intercettare una o più falde acquifere al fine di un loro sfruttamento
preferred label: Well for water @en
notation: 16
top concept of: Vocabolario dei termini delle risorse minerarie.
in scheme: Vocabolario dei termini delle risorse minerarie.
bibliographic citation: Artioli G.P. et al. 1997 - Carta Geologica d’Italia 1:50.000 Banca dati geologici: Linee guida per l’informatizzazione e per l’allestimento per la stampa dalla banca dati, I Quaderni, serie III, del SGI Volume 6/1997 (Ed. 2008).

Pozzo per acqua minerale
type: Concept
definition: Well built with the aim of intercepting one or more aquifers of thermo-mineral water for the purpose of their exploitation @en
definition: Pozzo realizzato con lo scopo di intercettare una o più falde acquifere di acqua termominerale al fine di un loro sfruttamento
preferred label: Well for mineral water @en
notation: 17
top concept of: Vocabolario dei termini delle risorse minerarie.
in scheme: Vocabolario dei termini delle risorse minerarie.
bibliographic citation: Artioli G.P. et al. 1997 - Carta Geologica d’Italia 1:50.000 Banca dati geologici: Linee guida per l’informatizzazione e per l’allestimento per la stampa dalla banca dati, I Quaderni, serie III, del SGI Volume 6/1997 (Ed. 2008).

Pozzo per acqua termominerale
type: Concept
definition: Well built with the aim of intercepting one or more aquifers of thermo-mineral water for the purpose of their exploitation @en
definition: Pozzo realizzato con lo scopo di intercettare una o più falde acquifere di acqua termominerale al fine di un loro sfruttamento
preferred label: Well for thermomineral water @en
notation: 18
top concept of: Vocabolario dei termini delle risorse minerarie.
in scheme: Vocabolario dei termini delle risorse minerarie.
bibliographic citation: Artioli G.P. et al. 1997 - Carta Geologica d’Italia 1:50.000 Banca dati geologici: Linee guida per l’informatizzazione e per l’allestimento per la stampa dalla banca dati, I Quaderni, serie III, del SGI Volume 6/1997 (Ed. 2008).

Pozzo per idrocarburi liquidi
type: Concept
definition: Well built for the extraction of liquid hydrocarbons @en
definition: Pozzo realizzato per l’estrazione di idrocarburi liquidi
preferred label: Well for liquid hydrocarbons @en
notation: 19
top concept of: Vocabolario dei termini delle risorse minerarie.
in scheme: Vocabolario dei termini delle risorse minerarie.
bibliographic citation: Artioli G.P. et al. 1997 - Carta Geologica d’Italia 1:50.000 Banca dati geologici: Linee guida per l’informatizzazione e per l’allestimento per la stampa dalla banca dati, I Quaderni, serie III, del SGI Volume 6/1997 (Ed. 2008).

Pozzo per idrocarburi gassosi
type: Concept
definition: Well built for the extraction of gaseous hydrocarbons @en
definition: Pozzo realizzato per l’estrazione di idrocarburi gassosi
preferred label: Well for gaseous hydrocarbons @en
notation: 20
top concept of: Vocabolario dei termini delle risorse minerarie.
in scheme: Vocabolario dei termini delle risorse minerarie.
bibliographic citation: Artioli G.P. et al. 1997 - Carta Geologica d’Italia 1:50.000 Banca dati geologici: Linee guida per l’informatizzazione e per l’allestimento per la stampa dalla banca dati, I Quaderni, serie III, del SGI Volume 6/1997 (Ed. 2008).

Pozzo per ricerca mineraria
type: Concept
definition: Well built for the extraction of rocks and minerals of mineral interest @en
definition: Pozzo realizzato per l’estrazione di rocce e minerali di interesse minerario
preferred label: Well for mineral exploration @en
notation: 21
top concept of: Vocabolario dei termini delle risorse minerarie.
in scheme: Vocabolario dei termini delle risorse minerarie.
bibliographic citation: Artioli G.P. et al. 1997 - Carta Geologica d’Italia 1:50.000 Banca dati geologici: Linee guida per l’informatizzazione e per l’allestimento per la stampa dalla banca dati, I Quaderni, serie III, del SGI Volume 6/1997 (Ed. 2008).

Sondaggio esplorativo
type: Concept
definition: Drilling in the ground of a circular shape, with vertical or inclined development depending on the needs, carried out to define the physical-mechanical and hydraulic characteristics of the terrain crossed. During the survey, equipment is used that allows material to be collected from the subsoil, also for the purpose of carrying out laboratory analyzes and in situ geophysical, geotechnical and hydraulic tests. Exploratory surveys are carried out for multiple objectives: hydrocarbon exploration, mining, geothermal, scientific and/or implementation of an inclinometric or piezometric monitoring network. The exploratory survey should not be confused with the well, which represents a drilling for the extraction of already known natural resources @en
definition: Perforazione nel terreno di forma circolare, a sviluppo verticale o inclinato a seconda delle esigenze, effettuata per definire le caratteristiche fisico-meccaniche ed idrauliche dei terreni attraversati. Durante il sondaggio si utilizzano attrezzature che permettono di raccogliere materiale dal sottosuolo, anche al fine di effettuare analisi di laboratorio e prove in situ di tipo geofisico, geotecnico e idraulico. I sondaggi esplorativi vengono realizzati per molteplici obiettivi: ricerca di idrocarburi, mineraria, geotermica, scientifica e/o implementazione di una rete di monitoraggio inclinometrica o piezometrica. Il sondaggio esplorativo non va confuso con il pozzo, che rappresenta una perforazione per l’estrazione di risorse naturali già note
preferred label: Exploratory survey @en
notation: 22
top concept of: Vocabolario dei termini delle risorse minerarie.
in scheme: Vocabolario dei termini delle risorse minerarie.
bibliographic citation: Artioli G.P. et al. 1997 - Carta Geologica d’Italia 1:50.000 Banca dati geologici: Linee guida per l’informatizzazione e per l’allestimento per la stampa dalla banca dati, I Quaderni, serie III, del SGI Volume 6/1997 (Ed. 2008).

Songaggio geognostico CARG
type: Concept
definition: Exploratory survey carried out for scientific research purposes as part of the CARG Project, usually for the recovery of carrots preserved for analysis; the depth in meters from ground level is indicated on the side of the site @en
definition: Sondaggio esplorativo realizzato con finalità di ricerca scientifica nell’ambito del Progetto CARG, di regola a recupero di carote conservate per analisi; viene indicata a lato del sito la profondità in metri dal piano campagna
preferred label: CARG geognostic surveying @en
notation: 23
top concept of: Vocabolario dei termini delle risorse minerarie.
in scheme: Vocabolario dei termini delle risorse minerarie.
bibliographic citation: Artioli G.P. et al. 1997 - Carta Geologica d’Italia 1:50.000 Banca dati geologici: Linee guida per l’informatizzazione e per l’allestimento per la stampa dalla banca dati, I Quaderni, serie III, del SGI Volume 6/1997 (Ed. 2008).

Sondaggio per ricerca di idrocarburi
type: Concept
definition: Exploratory survey carried out to define the physical-mechanical and hydraulic characteristics of the terrain crossed for the purposes of hydrocarbon exploration @en
definition: Sondaggio esplorativo effettuato per definire le caratteristiche fisico-meccaniche ed idrauliche dei terreni attraversati ai fini della ricerca di idrocarburi
preferred label: Survey for hydrocarbon exploration @en
notation: 24
top concept of: Vocabolario dei termini delle risorse minerarie.
in scheme: Vocabolario dei termini delle risorse minerarie.
bibliographic citation: Artioli G.P. et al. 1997 - Carta Geologica d’Italia 1:50.000 Banca dati geologici: Linee guida per l’informatizzazione e per l’allestimento per la stampa dalla banca dati, I Quaderni, serie III, del SGI Volume 6/1997 (Ed. 2008).

Sondaggio per ricerca di geotermica
type: Concept
definition: Exploratory survey carried out to define the physical-mechanical and hydraulic characteristics of the terrain crossed for the purposes of geothermal research @en
definition: Sondaggio esplorativo effettuato per definire le caratteristiche fisico-meccaniche ed idrauliche dei terreni attraversati ai fini della ricerca geotermica
preferred label: Survey for geothermal research @en
notation: 25
top concept of: Vocabolario dei termini delle risorse minerarie.
in scheme: Vocabolario dei termini delle risorse minerarie.
bibliographic citation: Artioli G.P. et al. 1997 - Carta Geologica d’Italia 1:50.000 Banca dati geologici: Linee guida per l’informatizzazione e per l’allestimento per la stampa dalla banca dati, I Quaderni, serie III, del SGI Volume 6/1997 (Ed. 2008).

Sondaggio per ricerca mineraria
type: Concept
definition: Exploratory survey carried out to define the physical-mechanical and hydraulic characteristics of the terrain crossed for the purposes of mineral research @en
definition: Sondaggio esplorativo effettuato per definire le caratteristiche fisico-meccaniche ed idrauliche dei terreni attraversati ai fini della ricerca mineraria
preferred label: Survey for mineral exploration @en
notation: 26
top concept of: Vocabolario dei termini delle risorse minerarie.
in scheme: Vocabolario dei termini delle risorse minerarie.
bibliographic citation: Artioli G.P. et al. 1997 - Carta Geologica d’Italia 1:50.000 Banca dati geologici: Linee guida per l’informatizzazione e per l’allestimento per la stampa dalla banca dati, I Quaderni, serie III, del SGI Volume 6/1997 (Ed. 2008).

Manifestazioni di interesse minerario
type: Concept
definition: Any geological evidence that suggests the presence of exploitable concentrations of a particular mineral @en
definition: Qualunque evidenza geologica che suggerisce la presenza di concentrazioni sfruttabili di un determinato minerale
preferred label: Manifestations of mining interest @en
notation: 27
top concept of: Vocabolario dei termini delle risorse minerarie.
in scheme: Vocabolario dei termini delle risorse minerarie.
bibliographic citation: Artioli G.P. et al. 1997 - Carta Geologica d’Italia 1:50.000 Banca dati geologici: Linee guida per l’informatizzazione e per l’allestimento per la stampa dalla banca dati, I Quaderni, serie III, del SGI Volume 6/1997 (Ed. 2008).

Area interessata da sondaggi per ricerca mineraria
type: Concept
definition: Portion of territory within which surveys aimed at mineral research were carried out, due to the peculiar characteristics of the deposits present @en
definition: Porzione di territorio all’interno del quale sono stati eseguiti sondaggi finalizzati alla ricerca mineraria, per le peculiari caratteristiche dei depositi presenti
preferred label: Area affected by surveys for mineral research @en
notation: 28
top concept of: Vocabolario dei termini delle risorse minerarie.
in scheme: Vocabolario dei termini delle risorse minerarie.
bibliographic citation: Artioli G.P. et al. 1997 - Carta Geologica d’Italia 1:50.000 Banca dati geologici: Linee guida per l’informatizzazione e per l’allestimento per la stampa dalla banca dati, I Quaderni, serie III, del SGI Volume 6/1997 (Ed. 2008).

Prove penetrometriche
type: Concept
definition: Mechanical tests carried out using a penetrometer, both static and dynamic, aimed at evaluating the geotechnical characteristics of the soil @en
definition: Prove meccaniche eseguite attraverso penetrometro, sia di tipo statico che dinamico, finalizzate alla valutazione delle caratteristiche geotecniche del terreno
preferred label: Penetrometric tests @en
notation: 29
top concept of: Vocabolario dei termini delle risorse minerarie.
in scheme: Vocabolario dei termini delle risorse minerarie.
bibliographic citation: Artioli G.P. et al. 1997 - Carta Geologica d’Italia 1:50.000 Banca dati geologici: Linee guida per l’informatizzazione e per l’allestimento per la stampa dalla banca dati, I Quaderni, serie III, del SGI Volume 6/1997 (Ed. 2008).

Prove penetrometriche dinamiche
type: Concept
definition: Also called DP (Dynamic Penetration), they consist of vertically inflicting a conical metal tip placed at the end of a steel rod into the ground by dropping a hammer of a given weight from a constant height and counting the number of blows necessary for the penetration of each section of established length (beating). @en
definition: Dette anche DP (Dynamic Penetration), consistono nell'infliggere verticalmente nel terreno una punta conica metallica posta all’estremità di un’asta di acciaio facendo cadere un maglio di dato peso da un’altezza costante e contando il numero dei colpi necessario per la penetrazione di ciascun tratto di lunghezza stabilita (battitura)
preferred label: Dynamic penetrometric tests @en
notation: 30
top concept of: Vocabolario dei termini delle risorse minerarie.
in scheme: Vocabolario dei termini delle risorse minerarie.
bibliographic citation: Artioli G.P. et al. 1997 - Carta Geologica d’Italia 1:50.000 Banca dati geologici: Linee guida per l’informatizzazione e per l’allestimento per la stampa dalla banca dati, I Quaderni, serie III, del SGI Volume 6/1997 (Ed. 2008).

Prove penetrometriche statiche
type: Concept
definition: Also called CPT (Cone Penetration Test), they consist of inflicting pressure on the ground with a conical tip (electrically instrumented) continuously measuring the effort necessary for the penetration of the tip and the soil-steel adhesion of a sleeve placed above the tip. If the latter is equipped with a piezocone, the test is called CPTU (measurement of pressure in the pores) @en
definition: Dette anche CPT (Cone Penetration Test), consistono nell'infliggere a pressione nel terreno una punta conica (strumentata elettricamente) misurando con continuità lo sforzo necessario per la penetrazione della punta e l’adesione terreno-acciaio di un manicotto posto al di sopra della punta. Se quest’ultima è munita di piezocono la prova è detta CPTU (misurazione della pressione nei pori)
preferred label: Static penetrometric tests @en
notation: 31
top concept of: Vocabolario dei termini delle risorse minerarie.
in scheme: Vocabolario dei termini delle risorse minerarie.
bibliographic citation: Artioli G.P. et al. 1997 - Carta Geologica d’Italia 1:50.000 Banca dati geologici: Linee guida per l’informatizzazione e per l’allestimento per la stampa dalla banca dati, I Quaderni, serie III, del SGI Volume 6/1997 (Ed. 2008).

Trivellazione manuale
type: Concept
definition: Drilling in inconsistent and fine-grained soils, carried out manually by rotation, consisting of the insertion of small diameter metal rods with a sampler at the end. The reachable depths depend on the consistency and thickness of the loose soils (depths of the order of 10 m @en
definition: Perforazione in terreni poco coerenti e a granulometria fine, effettuata manualmente tramite rotazione, consistente nell’infissione di aste metalliche di piccolo diametro con all’estremità un campionatore. Le profondità raggiungibili dipendono dalla consistenza e dallo spessore dei terreni incoerenti (profondità dell’ordine dei 10 m
preferred label: Manual drilling @en
notation: 32
top concept of: Vocabolario dei termini delle risorse minerarie.
in scheme: Vocabolario dei termini delle risorse minerarie.
bibliographic citation: Artioli G.P. et al. 1997 - Carta Geologica d’Italia 1:50.000 Banca dati geologici: Linee guida per l’informatizzazione e per l’allestimento per la stampa dalla banca dati, I Quaderni, serie III, del SGI Volume 6/1997 (Ed. 2008).

Carotaggio
type: Concept
definition: Collection of cylindrical portions of sediment and/or rock (core), of variable length depending on the nature of the deposit and the propulsion force (gravity or vibration motor) obtained by inserting a cylindrical instrument (core barrel) @en
definition: Prelievo di porzioni di sedimento e/o roccia di forma cilindrica (carota), di lunghezza variabile a seconda della natura del deposito e della forza di propulsione (gravità o motore a vibrazione) ottenuto mediante l’infissione di uno strumento cilindrico (carotiere)
preferred label: Core drilling @en
notation: 33
top concept of: Vocabolario dei termini delle risorse minerarie.
in scheme: Vocabolario dei termini delle risorse minerarie.
bibliographic citation: Artioli G.P. et al. 1997 - Carta Geologica d’Italia 1:50.000 Banca dati geologici: Linee guida per l’informatizzazione e per l’allestimento per la stampa dalla banca dati, I Quaderni, serie III, del SGI Volume 6/1997 (Ed. 2008).

Carotaggio a gravitá
type: Concept
definition: Used only where short cores are required. Core barrel is gravity forced into poorly consolidated material, producing near surface high quality core @en
definition: Carotaggio lungo fondali, generalmente, sabbiosi, limosi e argillosi, mediante carotiere la cui infissione avviene in funzione del proprio peso
preferred label: Gravity core drilling @en
notation: 34
top concept of: Vocabolario dei termini delle risorse minerarie.
in scheme: Vocabolario dei termini delle risorse minerarie.
bibliographic citation: Artioli G.P. et al. 1997 - Carta Geologica d’Italia 1:50.000 Banca dati geologici: Linee guida per l’informatizzazione e per l’allestimento per la stampa dalla banca dati, I Quaderni, serie III, del SGI Volume 6/1997 (Ed. 2008).

Vibrocarotaggio
type: Concept
definition: Sampling method with a core barrel that penetrates the sediments driven by vibrations generated by a motor @en
definition: Metodo di campionamento con carotiere che penetra nei sedimenti spinto da vibrazioni generate da un motore
preferred label: Vibro-coring @en
notation: 35
top concept of: Vocabolario dei termini delle risorse minerarie.
in scheme: Vocabolario dei termini delle risorse minerarie.
bibliographic citation: Artioli G.P. et al. 1997 - Carta Geologica d’Italia 1:50.000 Banca dati geologici: Linee guida per l’informatizzazione e per l’allestimento per la stampa dalla banca dati, I Quaderni, serie III, del SGI Volume 6/1997 (Ed. 2008).

Dragaggio
type: Concept
definition: Submarine sampling method, with towed instrument @en
definition: Metodo di campionamento sottomarino, con strumento a traino
preferred label: Dredging @en
notation: 36
top concept of: Vocabolario dei termini delle risorse minerarie.
in scheme: Vocabolario dei termini delle risorse minerarie.
bibliographic citation: Artioli G.P. et al. 1997 - Carta Geologica d’Italia 1:50.000 Banca dati geologici: Linee guida per l’informatizzazione e per l’allestimento per la stampa dalla banca dati, I Quaderni, serie III, del SGI Volume 6/1997 (Ed. 2008).

Bennata
type: Concept
definition: Sediment sampling with a “jaw” instrument (bucket) @en
definition: Campionamento di sedimenti con strumento a “ganascia” (benna)
preferred label: Bucket @en
notation: 37
top concept of: Vocabolario dei termini delle risorse minerarie.
in scheme: Vocabolario dei termini delle risorse minerarie.
bibliographic citation: Artioli G.P. et al. 1997 - Carta Geologica d’Italia 1:50.000 Banca dati geologici: Linee guida per l’informatizzazione e per l’allestimento per la stampa dalla banca dati, I Quaderni, serie III, del SGI Volume 6/1997 (Ed. 2008).

Box-core
type: Concept
definition: Sampling method that allows precise quantities of sample to be taken, preserving the spatial distribution of sediments and organisms @en
definition: Metodo di campionamento che consente di prelevare quantità precise di campione, conservando la distribuzione spaziale dei sedimenti e degli organismi
notation: 38
top concept of: Vocabolario dei termini delle risorse minerarie.
in scheme: Vocabolario dei termini delle risorse minerarie.
bibliographic citation: Artioli G.P. et al. 1997 - Carta Geologica d’Italia 1:50.000 Banca dati geologici: Linee guida per l’informatizzazione e per l’allestimento per la stampa dalla banca dati, I Quaderni, serie III, del SGI Volume 6/1997 (Ed. 2008).

Immersione con telecamera filoguidata
type: Concept
definition: Location of the location in which a visual survey in a submerged area was carried out and recorded using remotely controlled instrumentation (ROV) @en
definition: Ubicazione della località nella quale è stata effettuata e registrata un’indagine visiva in area sommersa per mezzo di strumentazione controllata da remoto (ROV)
preferred label: Dive with wire-guided camera @en
notation: 39
top concept of: Vocabolario dei termini delle risorse minerarie.
in scheme: Vocabolario dei termini delle risorse minerarie.
bibliographic citation: Artioli G.P. et al. 1997 - Carta Geologica d’Italia 1:50.000 Banca dati geologici: Linee guida per l’informatizzazione e per l’allestimento per la stampa dalla banca dati, I Quaderni, serie III, del SGI Volume 6/1997 (Ed. 2008).

Immersione con operatore subacqueo
type: Concept
definition: Location of the location where a direct survey was carried out in a submerged area @en
definition: Ubicazione della località nella quale è stato effettuato un rilevamento diretto in area sommersa
preferred label: Diving with a diver @en
notation: 40
top concept of: Vocabolario dei termini delle risorse minerarie.
in scheme: Vocabolario dei termini delle risorse minerarie.
bibliographic citation: Artioli G.P. et al. 1997 - Carta Geologica d’Italia 1:50.000 Banca dati geologici: Linee guida per l’informatizzazione e per l’allestimento per la stampa dalla banca dati, I Quaderni, serie III, del SGI Volume 6/1997 (Ed. 2008).