Vocabolario dei siti d'interesse geologico.
type: ConceptScheme
type: Dataset
type: Asset
title: Vocabulary of sites of geological interest. @en
description: The terms represent the classes of geological interest foreseen by the CARG geological cartography. @en
description: I teermini rappresentano le classi di interesse geologico previste dalla cartografia geologica CARG.
issued: 2024-09-28
modified: 2024-09-28
creator: ISPRA03
rights holder: Istituto Superiore per la Protezione e la Ricerca Ambientale
version info: 1.0
language: ITA
language: ENG
theme: ge
theme: mr
keyword: Geologia
keyword: GeoSciencesIR @en
keyword: Gestione del suolo
keyword: Risorse naturali
keyword: Mineral resources @en
keyword: Geologic @en
accrual periodicity: IRREG
distribution: geo-observationSites-RDF-TURTLE
type: CodeList
contact point: ISPRA03
number of levels: 1
key concept: observationSites
conforms to: SKOS
representation technique: SKOS
creator: Roberta Carta
creator: Loredana Battaglini
creator: Francesco Clemente
creator: Patrizio Petricca (ORCID: 0000-0003-1186-4296)
creator: Lorenzo Pistocchi
creator: Paolo Lino Manganello
creator: Maria Pia Congi (ORCID: 0000-0002-9330-9554)
creator: Carlo Cipolloni (ORCID: 0000-0001-7652-9814)
creator: Elio Giulianelli (ORCID: 0000-0003-0998-9751)
comment: Standardizzazione dei termini e dei parametri utilizzati nelle codelist durante il processo di armonizzazione verso INSPIRE/CGI dei parametri del progetto di carta geologica CARG.
comment: Standardization of terms and parameters used in codelists during the process of harmonization with INSPIRE/CGI of the CARG geological map project parameters. @en
publisher: Istituto Superiore per la Protezione e la Ricerca Ambientale
has top concept: Affioramento geologico o elemento geomorfologico di particolare interesse
has top concept: Affioramento di interesse stratigrafico
has top concept: Località fossilifera
has top concept: Località fossilifera a vertebrati
has top concept: Località fossilifera ad invertebrati
has top concept: Località fossilifera a vegetali
has top concept: Affioramento di interesse sedimentologico
has top concept: Slump intraformazionale non cartografabile
has top concept: Affioramento di interesse strutturale
has top concept: Stazione strutturale (numerata)
has top concept: Affioramento/località di interesse mineralogico petrografico
has top concept: Profilo pedogenetico
has top concept: Stratificazione diritta
has top concept: Clinostratificazione
has top concept: Stratificazione orizzontale diritta
has top concept: Stratificazione verticale con indicazione della polarità
has top concept: Stratificazione rovesciata
has top concept: Stratificazione rovesciata orizzontale
has top concept: Stratificazione contorta con valori medi di immersione ed inclinazione
has top concept: Stratificazione a polarità sconosciuta
has top concept: Stratificazione verticale a polarità sconosciuta
has top concept: Stratificazione orizzontale a polarità sconosciuta
has top concept: Direzione di younging
has top concept: Superficie di clivaggio o scistosità inclinata
has top concept: Superficie di clivaggio o scistosità orizzontale
has top concept: Superficie di clivaggio o scistosità verticale
has top concept: Fabric composito
has top concept: Stria e/o fibra di faglia (slickenline)
has top concept: Stria e/o fibra di faglia verticale
has top concept: Stria e/o fibra di faglia orizzontale
has top concept: Elemento lineare primario
has top concept: Elemento lineare primario verticale
has top concept: Elemento lineare primario orizzontale
has top concept: Lineazione di estensione (orientazione preferenziale di forma)
has top concept: Lineazione minerale
has top concept: Lineazione d'intersezione
has top concept: Lineazione di estensione (orientazione preferenziale di forma) orizzontale
has top concept: Lineazione minerale orizzontale

Istituto Superiore per la Protezione e la Ricerca Ambientale
type: NamedIndividual
type: Agent
type: Organization
type: Organosation
fn: Istituto Superiore per la Protezione e la Ricerca Ambientale

ISPRA03
type: NamedIndividual
type: Organization
type: Kind
fn: Unità ISPRA 03 del progetto GeoSciencesIR (Research Infrastructure)
fn: GeoSciencesIR (Research Infrastructure) project Unit ISPRA 03 @en

Distribuzione RDF/Turtle del vocabolario controllato GeoSciencesIR per i tipi di affioramento d'interesse geologico del progetto CARG.
type: Distribution
format: RDF TURTLE
license: A21 CCBY40
title: RDF/Turtle distribution of the GeoSciencesIR controlled vocabulary for the outcrop types of geological interest of the CARG project. @en
description: Questa è la Distribuzione RDF/Turtle del vocabolario controllato GeoSciencesIR per i tipi di affioramento d'interesse geologico del progetto CARG.
description: This is the RDF/Turtle distribution of the GeoSciencesIR controlled vocabulary for the outcrop types of geological interest of the CARG project. @en
access URL: https://github.com/isprambiente/dati-semantic/tree/main/assets/controlled-vocabularies/geo/observationSites
download URL: https://raw.githubusercontent.com/isprambiente/dati-semantic/main/assets/controlled-vocabularies/geo/observationSites/observationSites.ttl

Affioramento geologico o elemento geomorfologico di particolare interesse
type: Concept
definition: Outcrop whose overall characteristics lend themselves to the study of the interpretation, origin, distribution and mutual relationships of the forms that make up the terrestrial relief @en
definition: Affioramento le cui caratteristiche di assieme si prestano allo studio dell’interpretazione, dell’origine, della distribuzione e dei rapporti reciproci delle forme che compongono il rilievo terrestre
preferred label: Geological outcrop or geomorphological element of particular interest @en
notation: 1
top concept of: Vocabolario dei siti d'interesse geologico.
in scheme: Vocabolario dei siti d'interesse geologico.

Affioramento di interesse stratigrafico
type: Concept
definition: Outcrop in which the characteristics and/or mutual relationships between the different stratigraphic units that make up that portion of territory are well exposed @en
definition: Affioramento nel quale risultano ben esposte le caratteristiche e/o i rapporti reciproci tra le diverse unità stratigrafiche che costituiscono quella porzione di territorio
preferred label: Outcrop of stratigraphic interest @en
notation: 2
top concept of: Vocabolario dei siti d'interesse geologico.
in scheme: Vocabolario dei siti d'interesse geologico.

Località fossilifera
type: Concept
definition: Outcrop reported for the presence of important fossil remains @en
definition: Affioramento segnalato per la presenza di importanti resti di fossili
preferred label: Fossiliferous locality @en
notation: 3
top concept of: Vocabolario dei siti d'interesse geologico.
in scheme: Vocabolario dei siti d'interesse geologico.

Località fossilifera a vertebrati
type: Concept
definition: Fossiliferous locality characterized by remains of fossil vertebrates clearly visible upon soil analysis @en
definition: Località fossilifera caratterizzata da resti di vertebrati fossili ben visibili ad un’analisi di terreno
preferred label: Fossiliferous locality for vertebrates @en
notation: 4
top concept of: Vocabolario dei siti d'interesse geologico.
in scheme: Vocabolario dei siti d'interesse geologico.

Località fossilifera ad invertebrati
type: Concept
definition: Fossiliferous locality characterized by remains of fossil invertebrates clearly visible upon soil analysis @en
definition: Località fossilifera caratterizzata da resti di invertebrati fossili ben visibili ad un’analisi di terreno
preferred label: Locality fossiliferous to invertebrates @en
notation: 5
top concept of: Vocabolario dei siti d'interesse geologico.
in scheme: Vocabolario dei siti d'interesse geologico.

Località fossilifera a vegetali
type: Concept
definition: Fossiliferous locality characterized by remains of fossil plants (thalli, leaves, roots, oogonia) clearly visible upon soil analysis @en
definition: Località fossilifera caratterizzata da resti di vegetali fossili (talli, foglie, radici, oogoni) ben visibili ad un’analisi di terreno
preferred label: Fossiliferous vegetal locality @en
notation: 6
top concept of: Vocabolario dei siti d'interesse geologico.
in scheme: Vocabolario dei siti d'interesse geologico.

Affioramento di interesse sedimentologico
type: Concept
definition: Outcrop in which the textural, sedimentological and structural characteristics of the units that constitute a given portion of territory are well exposed @en
definition: Affioramento nel quale risultano ben esposte le caratteristiche tessiturali, sedimentologiche e strutturali delle unità che costituiscono una data porzione di territorio
preferred label: Outcrop of sedimentological interest @en
notation: 7
top concept of: Vocabolario dei siti d'interesse geologico.
in scheme: Vocabolario dei siti d'interesse geologico.

Slump intraformazionale non cartografabile
type: Concept
definition: Slump characterizing a formation whose size/extension in outcrop is too limited to be mapped @en
definition: Slump caratterizzante una formazione, di dimensione/estensione in affioramento troppo limitata da poter essere cartografabile
preferred label: Non-mapping intraformational slump @en
notation: 8
top concept of: Vocabolario dei siti d'interesse geologico.
in scheme: Vocabolario dei siti d'interesse geologico.

Affioramento di interesse strutturale
type: Concept
definition: Outcrop where it is possible to directly observe exemplary deformational structures, involving rock masses and/or non-lithified deposits @en
definition: Affioramento dove è possibile osservare direttamente strutture deformative esemplificative, che coinvolgono ammassi rocciosi e/o depositi non litificati
preferred label: Outcrop of structural interest @en
notation: 9
top concept of: Vocabolario dei siti d'interesse geologico.
in scheme: Vocabolario dei siti d'interesse geologico.

Stazione strutturale (numerata)
type: Concept
definition: Outcrop studied from a structural point of view through the measurement and statistical processing of plane positions, lineations and striae and/or fault fibers (stria and/or fault fiber (slickenline)) @en
definition: Affioramento studiato dal punto di vista strutturale tramite la misurazione e l’elaborazione statistica delle giaciture di piani, lineazioni e strie e/o fibre di faglia (stria e/o fibra di faglia (slickenline))
preferred label: Structural station (numbered) @en
notation: 10
top concept of: Vocabolario dei siti d'interesse geologico.
in scheme: Vocabolario dei siti d'interesse geologico.

Affioramento/località di interesse mineralogico petrografico
type: Concept
definition: Outcrop in which one or more geological units are exposed, whose constituent elements have particular relevance from a petrographic mineralogical point of view @en
definition: Affioramento nel quale risultano esposte una o più unità geologiche, i cui elementi costitutivi presentano una rilevanza particolare dal punto di vista mineralogico petrografico
preferred label: Outcrop/location of petrographic mineralogical interest @en
notation: 11
top concept of: Vocabolario dei siti d'interesse geologico.
in scheme: Vocabolario dei siti d'interesse geologico.

Profilo pedogenetico
type: Concept
definition: Section (vertical) of a soil that allows investigating the characteristics and processes of its formation. In a pedogenetic profile, different horizons can be distinguished, called, from top to bottom: A) where the organic matter content is maximum and the eluviation process takes place; B) horizon where the elements removed from the portions of soil above accumulate (illuviation); C) transition zone between the soil and the substrate; D) substrate @en
definition: Sezione (verticale) di un suolo che consente di indagare le caratteristiche e i processi di formazione di quest’ultimo. In un profilo pedogenetico si possono distinguere diversi orizzonti chiamati, dall’alto verso il basso: A) dove è massimo il contenuto di materia organica e avviene il processo di eluviazione; B) orizzonte dove si accumulano gli elementi rimossi dalle porzioni di suolo sovrastante (illuviazione); C) zona di transizione tra il suolo e il substrato; D) substrato
preferred label: pedogenetic profile @en
notation: 12
top concept of: Vocabolario dei siti d'interesse geologico.
in scheme: Vocabolario dei siti d'interesse geologico.

Stratificazione diritta
type: Concept
definition: Stratification that follows the “principle of superposition” of stratigraphy, according to which sedimentary successions are originally ordered with the lower layers older than those above. Stratification with inclination between 5° and 85° @en
definition: Stratificazione che segue il “principio di sovrapposizione” della stratigrafia, secondo il quale le successioni sedimentarie sono originariamente ordinate con gli strati inferiori più antichi di quelli sovrastanti. Stratificazione con inclinazione compresa tra 5° e 85°
preferred label: Straight layering @en
notation: 13
top concept of: Vocabolario dei siti d'interesse geologico.
in scheme: Vocabolario dei siti d'interesse geologico.

Clinostratificazione
type: Concept
definition: Primary sedimentary structure linked to the accumulation of sediments at an angle to the horizontal and on an underlying inclined surface (clinoforms). The sedimentary process can occur both by frontal and lateral growth. The term is used at various physical scales and in various depositional contexts, both marine (e.g., slopes prograding in the Triassic carbonate platforms of the Dolomites; deltas prograding in current marine systems) and continental (e.g., slope breccias; foresets of aeolian dunes). In the context of submerged areas, the term is synonymous with offlap in seismic reflection profiles @en
definition: Struttura sedimentaria primaria legata all’accumulo di sedimenti con un angolo rispetto all’orizzontale e su una superficie sottostante inclinata (clinoforme). Il processo sedimentario può avvenire sia per accrescimento frontale che laterale. Il termine è usato a varie scale fisiche e in vari contesti deposizionali, sia marini (e.g., slope progradanti nelle piattaforme carbonatiche triassiche delle Dolomiti; delta progradante in sistemi marini attuali) che continentali (e.g., brecce di versante; foreset di dune eoliche). Nell’ambito delle aree sommerse, il termine è sinonimo di offlap nei profili sismici a riflessione
preferred label: Clinostratification @en
notation: 14
top concept of: Vocabolario dei siti d'interesse geologico.
in scheme: Vocabolario dei siti d'interesse geologico.

Stratificazione orizzontale diritta
type: Concept
definition: Straight stratification, not or slightly inclined, with horizontal or sub-horizontal position (0°-4°) @en
definition: Stratificazione diritta non o blandamente inclinata, con giacitura orizzontale o sub-orizzontale (0°-4°)
preferred label: Straight horizontal layering @en
notation: 15
top concept of: Vocabolario dei siti d'interesse geologico.
in scheme: Vocabolario dei siti d'interesse geologico.

Stratificazione verticale con indicazione della polarità
type: Concept
definition: Stratification with sub-vertical or vertical position (86°-90°), where it is possible to recognize the direction of younging @en
definition: Stratificazione con giacitura sub-verticale o verticale (86°-90°), dove è possibile riconoscere la direzione di younging
preferred label: Vertical layering with polarity indication @en
notation: 16
top concept of: Vocabolario dei siti d'interesse geologico.
in scheme: Vocabolario dei siti d'interesse geologico.

Stratificazione rovesciata
type: Concept
definition: Layering that has undergone a deformation process such that it has been rotated more than 90° from its original horizontal position, with the direction of rejuvenation of the layers directed downwards @en
definition: Stratificazione che ha subito un processo deformativo tale per cui è stata ruotata più di 90° dalla sua posizione originale orizzontale, con la direzione di ringiovanimento degli strati diretta verso il basso
preferred label: Reversed stratification @en
notation: 17
top concept of: Vocabolario dei siti d'interesse geologico.
in scheme: Vocabolario dei siti d'interesse geologico.

Stratificazione rovesciata orizzontale
type: Concept
definition: Layering that has undergone a deformation process such that it has been rotated more than 90° from its original horizontal position, with the direction of rejuvenation of the layers directed downwards @en
definition: Stratificazione che ha subito un processo deformativo tale per cui è stata ruotata più di 90° dalla sua posizione originale orizzontale, con la direzione di ringiovanimento degli strati diretta verso il basso
preferred label: Horizontal inverted stratification @en
notation: 18
top concept of: Vocabolario dei siti d'interesse geologico.
in scheme: Vocabolario dei siti d'interesse geologico.

Stratificazione contorta con valori medi di immersione ed inclinazione
type: Concept
definition: Stratification characterized by important variations in position at the scale of the outcrop, associated with syn- and/or post-diagenetic deformational events, and of which the average of the position measurements (azimuth) carried out on the variously oriented layer surfaces is reported @en
definition: Stratificazione caratterizzata da importanti variazioni di giacitura alla scala dell’affioramento, associata a eventi deformativi sin- e/o post-diagenetici, e della quale è riportata la media delle misurazioni giaciturali (azimut) effettuate sulle superfici di strato variamente orientate
preferred label: Twisted stratification with average values of dip and inclination @en
notation: 19
top concept of: Vocabolario dei siti d'interesse geologico.
in scheme: Vocabolario dei siti d'interesse geologico.

Stratificazione a polarità sconosciuta
type: Concept
definition: Layering in which it is not possible to recognize the polarity of the layers and, consequently, the direction of younging @en
definition: Stratificazione in cui non è possibile riconoscere la polarità degli strati e, di conseguenza, la direzione di younging
preferred label: Stratification of unknown polarity @en
notation: 20
top concept of: Vocabolario dei siti d'interesse geologico.
in scheme: Vocabolario dei siti d'interesse geologico.

Stratificazione verticale a polarità sconosciuta
type: Concept
definition: Stratification of unknown polarity with sub-vertical or vertical position (86°-90°) @en
definition: Stratificazione a polarità sconosciuta con giacitura sub-verticale o verticale (86°-90°)
preferred label: Vertical stratification of unknown polarity @en
notation: 21
top concept of: Vocabolario dei siti d'interesse geologico.
in scheme: Vocabolario dei siti d'interesse geologico.

Stratificazione orizzontale a polarità sconosciuta
type: Concept
definition: Stratification of unknown polarity not or slightly inclined, with horizontal or sub-horizontal position (0°-4°) @en
definition: Stratificazione a polarità sconosciuta non o blandamente inclinata, con giacitura orizzontale o sub-orizzontale (0°-4°)
preferred label: Horizontal stratification of unknown polarity @en
notation: 22
top concept of: Vocabolario dei siti d'interesse geologico.
in scheme: Vocabolario dei siti d'interesse geologico.

Direzione di younging
type: Concept
definition: Towards which the rocks that make up a sedimentary succession decrease in age. The direction of which the direction is determined, on the basis of geological, stratigraphic and paleontological considerations, is perpendicular to the stratification @en
definition: Verso in cui le rocce che compongono una successione sedimentaria diminuiscono di età. La direzione di cui viene determinato il verso, sulla base di considerazioni geologiche, stratigrafiche e paleontologiche, è perpendicolare alla stratificazione
preferred label: Direction of younging @en
notation: 23
top concept of: Vocabolario dei siti d'interesse geologico.
in scheme: Vocabolario dei siti d'interesse geologico.

Superficie di clivaggio o scistosità inclinata
type: Concept
definition: Cleavage surface or schistosity having a plunge between 10°-70° or 100°-170° @en
definition: Superficie di clivaggio o scistosità avente un plunge compreso tra 10°-70° o 100°-170°
preferred label: Cleavage surface or inclined schistosity @en
notation: 24
top concept of: Vocabolario dei siti d'interesse geologico.
in scheme: Vocabolario dei siti d'interesse geologico.

Superficie di clivaggio o scistosità orizzontale
type: Concept
definition: Cleavage surface or schistosity lying on a horizontal or sub-horizontal plane, i.e. with a plunge between 0°-10° or 170°-180° @en
definition: Superficie di clivaggio o scistosità giacente su un piano orizzontale o sub-orizzontale, cioè con plunge compreso tra 0°-10° o 170°-180°
preferred label: Cleavage surface or horizontal schistosity @en
notation: 25
top concept of: Vocabolario dei siti d'interesse geologico.
in scheme: Vocabolario dei siti d'interesse geologico.

Superficie di clivaggio o scistosità verticale
type: Concept
definition: Cleavage surface or schistosity lying on a sub-vertical or vertical plane, i.e. with a plunge between 80° and 100° @en
definition: Superficie di clivaggio o scistosità giacente su un piano sub-verticale o verticale, cioè con plunge compreso tra 80° e 100°
preferred label: Cleavage surface or vertical schistosity @en
notation: 26
top concept of: Vocabolario dei siti d'interesse geologico.
in scheme: Vocabolario dei siti d'interesse geologico.

Fabric composito
type: Concept
definition: Structure in which two (or more) new foliations form at low angles to each other during the same deformation event. The rock deformed, by ductile cutting, presents a characteristic fabric defined by these two foliations (fabric S-C) @en
definition: Struttura in cui due (o più) nuove foliazioni si formano a basso angolo l'una rispetto all’altra durante lo stesso evento deformativo. La roccia deformata, per taglio duttile, presenta un fabric caratteristico definito da queste due foliazioni (fabric S-C)
preferred label: Composite fabric @en
notation: 27
top concept of: Vocabolario dei siti d'interesse geologico.
in scheme: Vocabolario dei siti d'interesse geologico.

Stria e/o fibra di faglia (slickenline)
type: Concept
definition: Abrasion, groove or linear mineralization on a slip surface originating from the frictional movement of the roof block on the roof block of a fault. The striae should not be confused with a “lineation”. The striae and/or fibers of faults are kinematic indicators and provide indications regarding the direction of movement of the blocks of rock along the fault @en
definition: Abrasione, solco (groove) o mineralizzazione lineare su una superficie di scivolamento originata dal movimento frizionale del blocco di tetto su quello di tetto di una faglia. Le strie non vanno confuse con una “lineazione”. Le strie e/o le fibre di faglia sono indicatori cinematici e forniscono indicazioni riguardo la direzione del movimento dei blocchi di roccia lungo la faglia
preferred label: Stria and/or fault fiber (slickenline) @en
notation: 28
top concept of: Vocabolario dei siti d'interesse geologico.
in scheme: Vocabolario dei siti d'interesse geologico.

Stria e/o fibra di faglia verticale
type: Concept
definition: Stria and/or fault fiber (slickenline) arranged sub-vertically or vertically with a pitch angle between 80° and 100°. The formation of vertically arranged kinematic indicators is associated with dip-slip faults, or with oblique-slip or strike-slip paleofaults, subject however to post-tectonic rotation @en
definition: Stria e/o fibra di faglia (slickenline) disposta sub-verticalmente o verticalmente con angolo di pitch compreso tra 80° e 100°. La formazione di indicatori cinematici disposti verticalmente si associa con faglie dip-slip, o con paleofaglie a cinematica oblique-slip o strike-slip, soggetti però a rotazione post-tettonica
preferred label: Stria and/or vertical fault fiber @en
notation: 29
top concept of: Vocabolario dei siti d'interesse geologico.
in scheme: Vocabolario dei siti d'interesse geologico.

Stria e/o fibra di faglia orizzontale
type: Concept
definition: Stria and/or fault fiber (slickenline) arranged horizontally or sub-horizontally, with a pitch angle between 0°-10° or 170°-180°. The formation of horizontally arranged kinematic indicators is associated with strike-slip faults, or with oblique-slip or dip-slip paleofaults, subject however to post-tectonic rotation @en
definition: Stria e/o fibra di faglia (slickenline) disposta orizzontalmente o sub-orizzontalmente, con angolo di pitch compreso tra 0°-10° o 170°-180°. La formazione di indicatori cinematici disposti orizzontalmente si associa con faglie strike-slip, o con paleofaglie a cinematica oblique-slip o dip-slip, soggetti però a rotazione post-tettonica
preferred label: Stria and/or horizontal fault fiber @en
notation: 30
top concept of: Vocabolario dei siti d'interesse geologico.
in scheme: Vocabolario dei siti d'interesse geologico.

Elemento lineare primario
type: Concept
definition: Important and clearly recognizable linear element. Term to be used when the identified element cannot be inserted into a larger system of lineations (lineation of sedimentary origin, direction of flow in igneous rocks), but deserves, following its geological meaning, a distinction @en
definition: Elemento lineare importante e nettamente riconoscibile. Termine da utilizzare quando l’elemento individuato non può essere inserito in un più vasto sistema di lineazioni (lineazione di origine sedimentaria, direzione di flusso in rocce ignee), ma merita, in seguito al significato geologico, una distinzione
preferred label: Primary linear element @en
notation: 31
top concept of: Vocabolario dei siti d'interesse geologico.
in scheme: Vocabolario dei siti d'interesse geologico.

Elemento lineare primario verticale
type: Concept
definition: Primary linear element lying on a sub-vertical or vertical plane, i.e. with a plunge angle between 80° and 100° @en
definition: Elemento lineare primario giacente su un piano sub-verticale o verticale, cioè con angolo di plunge compreso tra 80° e 100°
preferred label: Vertical primary linear element @en
notation: 32
top concept of: Vocabolario dei siti d'interesse geologico.
in scheme: Vocabolario dei siti d'interesse geologico.

Elemento lineare primario orizzontale
type: Concept
definition: Primary linear element lying on a horizontal or sub-horizontal plane, i.e. with a plunge angle between 0°-10° or 170°-180° @en
definition: Elemento lineare primario giacente su un piano orizzontale o sub-orizzontale, cioè con angolo di plunge compreso tra 0°-10° o 170°-180°
preferred label: Primary horizontal linear element @en
notation: 33
top concept of: Vocabolario dei siti d'interesse geologico.
in scheme: Vocabolario dei siti d'interesse geologico.

Lineazione di estensione (orientazione preferenziale di forma)
type: Concept
definition: Lineation defined by elongate (prolate) fabric elements in which the alignment of the fabric elements, and the formation of prolate fabric elements is interpreted to be the product of crystal plastic deformation processes. Associated with mylontic foliation @en
definition: Lineazione caratterizzata dall’allineamento di elementi monocristallini o policristallini di qualsiasi dimensione (ooidi, grani, ciottoli, etc.) che sono stati allungati e/o ruotati durante un evento deformativo associato a processi di deformazione plastica dei cristalli. È comunque preferibile utilizzare il termine lineazione minerale
preferred label: Extension lineation (preferential shape orientation) @en
notation: 34
top concept of: Vocabolario dei siti d'interesse geologico.
in scheme: Vocabolario dei siti d'interesse geologico.

Lineazione minerale
type: Concept
definition: Lineation defined by alignment of elongate crystals that have a prismatic crystal habit or of monomineralic grain aggregates @en
definition: Lineazione caratterizzata da minerali e aggregati di minerali allineati secondo una orientazione cristallografica e/o dimensionale a seguito di ricristallizzazione, dissoluzione/precipitazione o rotazione rigida, e disposta su una superficie o pervasiva in un volume di roccia
preferred label: Mineral lineation @en
notation: 35
top concept of: Vocabolario dei siti d'interesse geologico.
in scheme: Vocabolario dei siti d'interesse geologico.

Lineazione d'intersezione
type: Concept
definition: Lineation characterized by the intersection of two or more sets of planar and/or linear structures. The most representative example is given by the combination of stratification and cleavage, but intersection lineations between two tectonic foliations, or those connected to folding, are frequent @en
definition: Lineazione caratterizzata dall’intersezione di due o più set di strutture planari e/o lineari. L’esempio più rappresentativo è dato dalla combinazione di stratificazione e clivaggio, ma frequenti sono le lineazioni di intersezione tra due foliazioni tettoniche, o quelle connesse al piegamento
preferred label: Intersection lineation @en
notation: 36
top concept of: Vocabolario dei siti d'interesse geologico.
in scheme: Vocabolario dei siti d'interesse geologico.

Lineazione di estensione (orientazione preferenziale di forma) orizzontale
type: Concept
definition: Extension lineation lying on a horizontal or sub-horizontal plane, i.e. with a plunge angle between 0°-10° or 170°-180° @en
definition: Lineazione di estensione giacente su un piano orizzontale o sub-orizzontale, cioè con angolo di plunge compreso tra 0°-10° o 170°-180°
preferred label: Horizontal extension lineation (preferential shape orientation). @en
notation: 37
top concept of: Vocabolario dei siti d'interesse geologico.
in scheme: Vocabolario dei siti d'interesse geologico.

Lineazione minerale orizzontale
type: Concept
definition: Mineral lineation lying on a horizontal or sub-horizontal plane, i.e. with a plunge angle between 0°-10° or 170°-180° @en
definition: Lineazione minerale giacente su un piano orizzontale o sub-orizzontale, cioè con angolo di plunge compreso tra 0°-10° o 170°-180°
preferred label: Horizontal mineral lineation @en
notation: 38
top concept of: Vocabolario dei siti d'interesse geologico.
in scheme: Vocabolario dei siti d'interesse geologico.

Lineazione d'intersezione orizzontale
type: Concept
definition: Intersection lineation lying on a horizontal or sub-horizontal plane, i.e. with a plunge angle between 0°-10° or 170°-180° @en
definition: Lineazione d’intersezione giacente su un piano orizzontale o sub-orizzontale, cioè con angolo di plunge compreso tra 0°-10° o 170°-180°
preferred label: Horizontal intersection lineation @en
notation: 39
top concept of: Vocabolario dei siti d'interesse geologico.
in scheme: Vocabolario dei siti d'interesse geologico.

Lineazione di estensione (orientazione preferenziale di forma) verticale
type: Concept
definition: Extension lineation lying on a sub-vertical or vertical plane, i.e. with a plunge angle between 80° and 100° @en
definition: Lineazione di estensione giacente su un piano sub-verticale o verticale, cioè con angolo di plunge compreso tra 80° e 100°
preferred label: Vertical extension lineation (preferential shape orientation). @en
notation: 40
top concept of: Vocabolario dei siti d'interesse geologico.
in scheme: Vocabolario dei siti d'interesse geologico.

Lineazione minerale verticale
type: Concept
definition: Mineral lineation lying on a sub-vertical or vertical plane, i.e. with a plunge angle between 80° and 100° @en
definition: Lineazione minerale giacente su un piano sub-verticale o verticale, cioè con angolo di plunge compreso tra 80° e 100°
preferred label: Vertical mineral lineation @en
notation: 41
top concept of: Vocabolario dei siti d'interesse geologico.
in scheme: Vocabolario dei siti d'interesse geologico.

Lineazione d'intersezione verticale
type: Concept
definition: Intersection lineation lying on a sub-vertical or vertical plane, i.e. with a plunge angle between 80° and 100° @en
definition: Lineazione d’intersezione giacente su un piano sub-verticale o verticale, cioè con angolo di plunge compreso tra 80° e 100°
preferred label: Vertical intersection lineation @en
notation: 42
top concept of: Vocabolario dei siti d'interesse geologico.
in scheme: Vocabolario dei siti d'interesse geologico.

Specchio di faglia inclinato
type: Concept
definition: Fault mirror with inclination between 5° and 85° @en
definition: Specchio di faglia con inclinazione compresa tra i 5° e gli 85°
preferred label: Tilted fault mirror @en
notation: 43
top concept of: Vocabolario dei siti d'interesse geologico.
in scheme: Vocabolario dei siti d'interesse geologico.

Specchio di faglia verticale
type: Concept
definition: Fault mirror with sub-vertical or vertical dip (86°-90°) @en
definition: Specchio di faglia con inclinazione sub-verticale o verticale (86°-90°)
preferred label: Vertical fault mirror @en
notation: 44
top concept of: Vocabolario dei siti d'interesse geologico.
in scheme: Vocabolario dei siti d'interesse geologico.

Specchio di faglia orizzontale
type: Concept
definition: Fault mirror with horizontal or sub-horizontal inclination (0°-4°) @en
definition: Specchio di faglia con inclinazione orizzontale o sub orizzontale (0°-4°)
preferred label: Horizontal fault mirror @en
notation: 45
top concept of: Vocabolario dei siti d'interesse geologico.
in scheme: Vocabolario dei siti d'interesse geologico.

Fratture e giunti
type: Concept
definition: Term inclusive of the items fractures and joints @en
definition: Termine comprensivo delle voci fratture e giunti
preferred label: Fractures and joints @en
notation: 46
top concept of: Vocabolario dei siti d'interesse geologico.
in scheme: Vocabolario dei siti d'interesse geologico.

Asse di piega simmetrica (vergenza neutra) con indicazione dell'inclinazione
type: Concept
definition: Symmetrical fold axis with a plunge angle between 10°-80° or 100°-170° @en
definition: Asse di piega simmetrica con un angolo di plunge compreso tra 10°-80° o 100°-170°
preferred label: Symmetrical fold axis (neutral vergence) with inclination indication @en
notation: 47
top concept of: Vocabolario dei siti d'interesse geologico.
in scheme: Vocabolario dei siti d'interesse geologico.

Asse di piega simmetrica (vergenza neutra) orizzontale
type: Concept
definition: Symmetrical fold axis lying on a horizontal or sub-horizontal plane, i.e. with a plunge angle between 0°-10° or 170°-180°. It can feature lying creases or horizontal creases @en
definition: Asse di piega simmetrica giacente su un piano orizzontale o sub-orizzontale, cioè con angolo di plunge compreso tra 0°-10° o 170°-180°. Può caratterizzare pieghe coricate o pieghe orizzontali
preferred label: Horizontal symmetrical fold axis (neutral vergence). @en
notation: 48
top concept of: Vocabolario dei siti d'interesse geologico.
in scheme: Vocabolario dei siti d'interesse geologico.

Asse di piega simmetrica (vergenza neutra) verticale
type: Concept
definition: Symmetrical fold axis lying on a sub-vertical or vertical plane, i.e. with a plunge angle between 80° and 100°. It features vertical creases @en
definition: Asse di piega simmetrica giacente su un piano sub-verticale o verticale, cioè con angolo di plunge compreso tra 80° e 100°. Caratterizza pieghe verticali
preferred label: Vertical symmetrical fold axis (neutral vergence). @en
notation: 49
top concept of: Vocabolario dei siti d'interesse geologico.
in scheme: Vocabolario dei siti d'interesse geologico.

Asse di piega asimmetrica
type: Concept
definition: Fold axis of an asymmetric fold @en
definition: Asse di piega di una piega asimmetrica
preferred label: Asymmetric fold axis @en
notation: 50
top concept of: Vocabolario dei siti d'interesse geologico.
in scheme: Vocabolario dei siti d'interesse geologico.

Asse di piega asimmetrica orizzontale
type: Concept
definition: Asymmetric fold axis lying on a horizontal or sub-horizontal plane, i.e. with a plunge angle between 0°-10° or 170°-180° @en
definition: Asse di piega asimmetrica che giace su un piano orizzontale o sub-orizzontale, cioè con angolo di plunge compreso tra 0°-10° o 170°-180°
preferred label: Horizontal asymmetric fold axis @en
notation: 51
top concept of: Vocabolario dei siti d'interesse geologico.
in scheme: Vocabolario dei siti d'interesse geologico.

Asse di piega asimmetrica verticale
type: Concept
definition: Asymmetric fold axis lying on a sub-vertical or vertical plane, i.e. with a plunge angle between 80° and 100° @en
definition: Asse di piega asimmetrica che giace su un piano sub-verticale o verticale, cioè con angolo di plunge compreso tra 80° e 100°
preferred label: Vertical asymmetric fold axis @en
notation: 52
top concept of: Vocabolario dei siti d'interesse geologico.
in scheme: Vocabolario dei siti d'interesse geologico.

Inclinazione del piano assiale riferita alla traccia della superficie assiale
type: Concept
definition: Angle described by the axial plane of a plicative structure with respect to the horizontal plane, and referred to the axial surface trace. @en
definition: Angolo descritto dal piano assiale di una struttura plicativa rispetto al piano orizzontale, e riferito alla traccia della superficie assiale.
preferred label: Inclination of the axial plane referred to the trace of the axial surface @en
notation: 53
top concept of: Vocabolario dei siti d'interesse geologico.
in scheme: Vocabolario dei siti d'interesse geologico.

Associazione di pieghe minori
type: Concept
definition: Pplication structures associated with folds of a larger order of magnitude, to which they are geometrically (i.e., have parallel axial planes) and genetically (formed during the same deformational event) linked @en
definition: Strutture plicative associate a pieghe con ordine di grandezza maggiore, alle quali sono geometricamente (i.e., hanno piani assiali paralleli) e geneticamente (formate durante lo stesso evento deformativo) legate
preferred label: Association of minor folds @en
notation: 54
top concept of: Vocabolario dei siti d'interesse geologico.
in scheme: Vocabolario dei siti d'interesse geologico.

Asse di piega
type: Concept
definition: In a cylindrical fold, the imaginary line that joins the points of maximum curvature in the hinge zone, or the intersection between the axial plane and each of the folded surfaces that constitute the plicative structure. The fold axis characterizes cylindrical folds, while in the case of non-cylindrical folds the term hinge line is used (Fossen, 2016). The fold axis has a direction and, if it lies on an inclined plane, a dip or plunge. @en
definition: In una piega cilindrica, la linea immaginaria che unisce i punti di massima curvatura nella zona di cerniera, o l’intersezione tra il piano assiale e ciascuna delle superfici piegate che costituiscono la struttura plicativa. L’asse di piega caratterizza le pieghe cilindriche, mentre nel caso di pieghe non cilindriche si utilizza il termine linea di cerniera (Fossen, 2016). L’asse della piega ha una direzione e, nel caso giacesse su un piano inclinato, un’immersione o plunge.
preferred label: Fold axis @en
notation: 55
top concept of: Vocabolario dei siti d'interesse geologico.
in scheme: Vocabolario dei siti d'interesse geologico.

Asse di piega orizzontale
type: Concept
definition: Fold axis lying on a horizontal or sub-horizontal plane, i.e. with a plunge angle between 0°-10° or 170°-180°. It can feature lying creases or horizontal creases @en
definition: Asse di piega giacente su un piano orizzontale o sub-orizzontale, cioè con angolo di plunge compreso tra 0°-10° o 170°-180°. Può caratterizzare pieghe coricate o pieghe orizzontali
preferred label: Horizontal fold axis @en
notation: 56
top concept of: Vocabolario dei siti d'interesse geologico.
in scheme: Vocabolario dei siti d'interesse geologico.

Asse di piega verticale
type: Concept
definition: Fold axis lying on a sub-vertical or vertical plane, i.e. with a plunge angle between 80° and 100°. It characterizes vertical folds, i.e. having the inclination of the vertical axial plane @en
definition: Asse di piega giacente su un piano sub-verticale o verticale, cioè con angolo di plunge compreso tra 80° e 100°. Caratterizza pieghe verticali, aventi cioè l’inclinazione del piano assiale verticale
preferred label: Vertical fold axis @en
notation: 57
top concept of: Vocabolario dei siti d'interesse geologico.
in scheme: Vocabolario dei siti d'interesse geologico.

Strutture reomorfiche
type: Concept
definition: Syn- and/or post-depositional deformational structures that develop in lava rocks or pyroclastic flow deposits prior to their solidification and consist of wavy or plastically folded beds/layers with deformation and stretching of vesicles and alignment of textural components. They are characteristic of volcanic products of high temperature and low viscosity @en
definition: Strutture deformative sin- e/o post-deposizionali che si sviluppano in rocce laviche o depositi di flusso piroclastico prima della loro solidificazione e consistono in letti/strati ondulati o piegati plasticamente con deformazione e stiratura delle vescicole e allineamento di componenti tessiturali. Sono caratteristiche di prodotti vulcanici di elevata temperatura e bassa viscosità
preferred label: Rheomorphic structures @en
notation: 58
top concept of: Vocabolario dei siti d'interesse geologico.
in scheme: Vocabolario dei siti d'interesse geologico.