Vocabolario delle evidenze superficiali delle faglie
type: ConceptScheme
type: Dataset
type: Asset
title: Vocabulary of fault surface evidences @en
description: Terms describing the surface evidence for which capable faults are mapped and included in the catalogue. @en
description: Termini che descrivono l'evidenza di superficie per le quali le faglie capaci vengono cartografate ed inserite nel catalogo.
issued: 2024-07-04
modified: 2024-07-04
creator: ISPRA12
rights holder: Istituto Superiore per la Protezione e la Ricerca Ambientale
version info: 1.0
language: ITA
language: ENG
theme: ge
theme: nz
theme: ENV
keyword: Geologia strutturale
keyword: GeoSciencesIR @en
keyword: Tettonica
keyword: Cartografia
keyword: Geologia
keyword: Tectonics @en
accrual periodicity: IRREG
distribution: Distribuzione RDF/Turtle del vocabolario controllato GeoSciencesIR per le evidenze superficiali delle faglie.
type: CodeList
contact point: ISPRA12
number of levels: 1
key concept: surfaceEvidences
conforms to: SKOS
representation technique: SKOS
creator: Anna Maria Blumetti (ORCID: 0000-0002-5331-9379)
creator: Pio Di Manna (ORCID: 0000-0003-3486-5136)
creator: Valerio Comerci (ORCID: 0000-0002-1022-9488)
creator: Deborah Maceroni
creator: Livio Bonadeo
creator: Giuseppe Castorina (ORCID: 0000-0003-1646-3010)
creator: Maria Pia Congi (ORCID: 0000-0002-9330-9554)
creator: Carlo Cipolloni (ORCID: 0000-0001-7652-9814)
creator: Elio Giulianelli (ORCID: 0000-0003-0998-9751)
comment: Standardizzazione dei termini e dei parametri utilizzati nelle codelist durante il processo di implementazione del Catalogo ITHACA, il database delle faglie capaci e dei siti paleosismologici.
comment: Standardization of terms and parameters used in codelists during the implementation process of the ITHACA Catalogue, the database of capable faults and paleoseismological sites. @en
publisher: Istituto Superiore per la Protezione e la Ricerca Ambientale
has top concept: Evidenza della traccia in superficie
has top concept: Faglia ipotizzata
has top concept: Faglia sepolta

Istituto Superiore per la Protezione e la Ricerca Ambientale
type: NamedIndividual
type: Agent
type: Organization
type: Organisation
fn: Istituto Superiore per la Protezione e la Ricerca Ambientale

Distribuzione RDF/Turtle del vocabolario controllato GeoSciencesIR per le evidenze superficiali delle faglie.
type: Distribution
format: RDF TURTLE
license: A21 CCBY40
title: RDF/Turtle distribution of the controlled vocabulary within GeoSciencsIR for the fault surface evidences. @en
description: Questa è la distribuzione RDF/Turtle del vocabolario controllato sviluppato nell'ambito di GeoSciencesIR per le evidenze superficiali delle faglie.
description: This is RDF/Turtle distribution of controlled vocabulary developed within GeoSciencesIR for the fault surface evidences. @en
access URL: https://github.com/isprambiente/dati-semantic/tree/main/assets/controlled-vocabularies/faults/surfaceEvidences
download URL: https://raw.githubusercontent.com/isprambiente/dati-semantic/main/assets/controlled-vocabularies/faults/surfaceEvidences/surfaceEvidences.ttl

ISPRA12
type: NamedIndividual
type: Organization
type: Kind
fn: Unità 12 del progetto GeoSciencesIR (Research Infrastructure)
fn: GeoSciencesIR (Research Infrastructure) project Unit 12 @en

Evidenza della traccia in superficie
type: Concept
definition: Faults outcrop and can be accurately traced with respect to observation scale in geological-structural mapping and/or can be recognised in high-resolution DEM/LiDAR and satellite/airborne images. These faults are generally characterised by displaced deposits/morphologies, i.e. they are characterised by the presence of fault mirrors, fault scarps and other morphological and drainage anomalies such as saddles, straight tributaries, etc. @en
definition: La faglia affiora e può essere tracciata con precisione, rispetto alla scala di osservazione in cartografie geologico-strutturali e/o può essere riconosciuta in immagini DEM/LiDAR e da satellite/aeree ad alta risoluzione. Queste faglie sono generalmente caratterizzate da depositi/morfologie dislocate, sono cioè caratterizzate dalla presenza di specchi di faglia, scarpate di faglia ed altre anomalie morfologiche e del drenaggio quali selle, impluvi rettilinei, etc.
preferred label: Evidence of surface trace @en
notation: 1
top concept of: Vocabolario delle evidenze superficiali delle faglie
in scheme: Vocabolario delle evidenze superficiali delle faglie
bibliographic citation: Definition provided by ITHACA Working Group - ISPRA 2024.

Faglia ipotizzata
type: Concept
definition: Faults are sub-surface or hypothesised, located imprecisely in geological/structural mapping, sometimes inferred from a discontinuous alignment of morphological fault indicators (e.g. isolated hills, deviated drainage network, rectilinear drainage lines, etc., rectilinear fronts, triangular facets, depending on kinematics). Therefore, these faults are assumed or assumed to exist due to structural/sedimentary/morphological evidence, but no precise traces have yet been identified. @en
definition: La faglia è sub-affiorante o ipotizzata, localizzata in modo non preciso nelle cartografie geologico/strutturali, talvolta dedotta da un allineamento discontinuo di indicatori morfologici di faglia (es. colline isolate, reticolo di drenaggio deviato, linee di drenaggio rettilinee, ecc., fronti rettilinei, faccette triangolari, a seconda della cinematica). Pertanto, queste faglie sono ipotizzate o si suppone che esistano a causa di evidenze strutturali/sedimentarie/morfologiche, ma non è stata ancora identificata alcuna traccia precisa.
preferred label: Subdued fault @en
notation: 2
top concept of: Vocabolario delle evidenze superficiali delle faglie
in scheme: Vocabolario delle evidenze superficiali delle faglie
bibliographic citation: Definition provided by ITHACA Working Group - ISPRA 2024.

Faglia sepolta
type: Concept
definition: The termination of the fault does not outcrop, but is only identified by geophysical surveys and/or boreholes or is deduced on the basis of structural/stratigraphic evidence (e.g. depicted in geological sections). These faults may be associated with more or less evident morphological anomalies (isolated hills, deviated drainage network, straight drainage lines, etc., depending on the kinematics). @en
definition: La terminazione della faglia non affiora, ma essa viene identificata solo da indagini geofisiche e/o da trivellazioni ovvero è dedotta sulla base di evidenze strutturali/stratigrafiche (ad esempio, è rappresentata in sezioni geologiche). Tali faglie possono essere associate ad anomalie morfologiche più o meno evidenti (colline isolate, reticolo di drenaggio deviato, linee di drenaggio rettilinee, etc., a seconda della cinematica).
preferred label: Buried fault @en
notation: 3
top concept of: Vocabolario delle evidenze superficiali delle faglie
in scheme: Vocabolario delle evidenze superficiali delle faglie
bibliographic citation: Definition provided by ITHACA Working Group - ISPRA 2024.