Vocabolario delle Età quaternarie
type: ConceptScheme
type: Dataset
type: Asset
title: Quaternaryt age vocabulary @en
description: Terms describing the chronological intervals that define capable fault activity @en
description: Termini che descrivono gli intervalli cronologici che definiscono l'attività delle faglie capaci
issued: 2024-07-04
modified: 2024-07-04
creator: ISPRA12
rights holder: Istituto Superiore per la Protezione e la Ricerca Ambientale,
version info: 1.0
language: ITA
language: ENG
theme: ge
theme: nz
theme: ENV
keyword: Geologia strutturale
keyword: GeoSciencesIR @en
keyword: Tettonica
keyword: Cartografia
keyword: Geologia
keyword: Geologic Structure @en
accrual periodicity: IRREG
distribution: Distribuzione RDF/Turtle del vocabolario controllato GeoSciencesIR per la cinematica della faglia
type: Taxonomy
type: assettype
contact point: ISPRA12
number of levels: 4
conforms to: SKOS
representation technique: SKOS
creator: Anna Maria Blumetti (ORCID: 0000-0002-5331-9379)
creator: Pio Di Manna (ORCID: 0000-0003-3486-5136)
creator: Valerio Comerci (ORCID: 0000-0002-1022-9488)
creator: Deborah Maceroni
creator: Livio Bonadeo
creator: Giuseppe Castorina (ORCID: 0000-0003-1646-3010)
creator: Mariapia Congi (ORCID: 0000-0002-9330-9554)
creator: Carlo Cipolloni (ORCID: 0000-0001-7652-9814)
creator: Elio Giulianelli (ORCID: 0000-0003-0998-9751)
comment: Standardizzazione dei termini e dei parametri utilizzati nelle codelist durante il processo di implementazione del Catalogo ITHACA, il database delle faglie capaci e dei siti paleosismologici.
comment: Standardization of terms and parameters used in codelists during the implementation process of the ITHACA Catalogue, the database of capable faults and paleoseismological sites. @en
publisher: Istituto Superiore per la Protezione e la Ricerca Ambientale,
key concept: quaternaryAges
has top concept: Quaternario
has top concept: Non definito

Istituto Superiore per la Protezione e la Ricerca Ambientale,
type: NamedIndividual
type: Agent
type: Organization
type: Organosation
fn: Istituto Superiore per la Protezione e la Ricerca Ambientale,

ISPRA12
type: NamedIndividual
type: Organization
type: Kind
fn: Unità 12 del progetto GeoSciencesIR (Research Infrastructure)
fn: GeoSciencesIR (Research Infrastructure) project Unit 12 @en

Quaternario
type: Concept
definition: Quaternary (older bound-2.588 Ma, younger bound-0.0 Ma) @en
definition: Quaternario (limite più antico-2,588 Ma, limite più giovane-0,0 Ma)
preferred label: Quaternary @en
notation: 1
top concept of: Vocabolario delle Età quaternarie
in scheme: Vocabolario delle Età quaternarie
bibliographic citation: Cohen, K.M., Finney, S.M., Gibbard, P.L., Fan, J.-X., 2013. The ICS International Chronostratigraphic Chart. Episodes 36, 199-204. www.episodes.org

Distribuzione RDF/Turtle del vocabolario controllato GeoSciencesIR per la cinematica della faglia
type: Distribution
format: RDF TURTLE
license: A21 CCBY40
title: RDF/Turtle distribution of the controlled vocabulary within GeoSciencsIR for fault kinematics @en
description: Questa è la distribuzione RDF/Turtle del vocabolario controllato sviluppato nell'ambito di GeoSciencesIR per la cinematica della faglia
description: This is RDF/Turtle distribution of controlled vocabulary developed within GeoSciencesIR for the fault kinematics @en
access URL: https://github.com/isprambiente/dati-semantic/tree/main/assets/controlled-vocabularies/faults/quaternaryAges
download URL: https://raw.githubusercontent.com/isprambiente/dati-semantic/main/assets/controlled-vocabularies/faults/quaternaryAges/quaternaryAges.ttl

Pleistocene
type: Concept
definition: Pleistocene (older bound-2.588 Ma, younger bound-0.0117 Ma) @en
definition: Pleistocene (limite più antico-2,588 Ma, limite più giovane-0,0117 Ma)
preferred label: Pleistocene generic @en
notation: 1.1
in scheme: Vocabolario delle Età quaternarie
bibliographic citation: Cohen, K.M., Finney, S.M., Gibbard, P.L., Fan, J.-X., 2013. The ICS International Chronostratigraphic Chart. Episodes 36, 199-204. www.episodes.org
broader: Quaternario
narrower: Pleistocene superiore
narrower: Parte alta del pleistocene medio
narrower: Pleistocene medio (125,000-700,000)
narrower: Parte bassa del Pleistocene medio

Pleistocene superiore
type: Concept
definition: Late/Upper Pleistocene (older bound-0.126 Ma, younger bound-0.0117 Ma) @en
definition: Pleistocene tardo/superiore (limite più antico-0,126 Ma, limite più giovane-0,0117 Ma)
preferred label: Upper Late Pleistocene @en
notation: 1.1.1
in scheme: Vocabolario delle Età quaternarie
bibliographic citation: Cohen, K.M., Finney, S.M., Gibbard, P.L., Fan, J.-X., 2013. The ICS International Chronostratigraphic Chart. Episodes 36, 199-204. www.episodes.org
broader: Pleistocene
narrower: Intervallo temporale 1 del Pleistocene Superiore
narrower: Intervallo temporale 2 del Pleistocene Superiore

Intervallo temporale 1 del Pleistocene Superiore
type: Concept
definition: Upper Pleistocene time span between 15 ky and 22 ky @en
definition: intervallo cronologico del Pleistocene Superiore compreso fra 15,000 e 20,000 anni
preferred label: Time span 1 of Late Pleistocene @en
notation: 1.1.1.1
in scheme: Vocabolario delle Età quaternarie
bibliographic citation: Definition provided by ITHACA Working Group - ISPRA 2024.
bibliographic citation: IUGS /CGI value
broader: Pleistocene superiore

Intervallo temporale 2 del Pleistocene Superiore
type: Concept
definition: Upper Pleistocene time span between 22 ky and 50 ky @en
definition: intervallo cronologico del Pleistocene Superiore compreso fra 22,000 e 50,000 anni
preferred label: Time span 2 of Late Pleistocene @en
notation: 1.1.1.2
in scheme: Vocabolario delle Età quaternarie
bibliographic citation: Definition provided by ITHACA Working Group - ISPRA 2024.
bibliographic citation: IUGS /CGI value
broader: Pleistocene superiore

Parte alta del pleistocene medio
type: Concept
definition: Time interval between the lower limit of the Upper Pleistocene, i.e. 125ky and 300ky @en
definition: Intervallo temporale compreso nel limite inferiore del Pleistocene Superiore, ovvero 125 mila anni e 300 mila anni
preferred label: Upper-part of middle Pleistocene @en
notation: 1.1.2
in scheme: Vocabolario delle Età quaternarie
bibliographic citation: Definition provided by ITHACA Working Group - ISPRA 2024.
bibliographic citation: IUGS /CGI value
broader: Pleistocene

Pleistocene medio (125,000-700,000)
type: Concept
definition: Ionian (older bound-0.781 Ma, younger bound-0.126 Ma) @en
definition: Ionio (limite più antico-0,781 Ma, limite più giovane-0,126 Ma)
preferred label: Ionian @en
alternative label: Ioniano
notation: 1.1.3
in scheme: Vocabolario delle Età quaternarie
bibliographic citation: Cohen, K.M., Finney, S.M., Gibbard, P.L., Fan, J.-X., 2013. The ICS International Chronostratigraphic Chart. Episodes 36, 199-204. www.episodes.org
broader: Pleistocene
narrower: Parte intermedia del Pleistocene medio

Parte intermedia del Pleistocene medio
type: Concept
definition: Middle Pleistocene time span between 300 ky and 700 ky @en
definition: Intervallo cronologico della parte inetrmedia del Pleistocene Medio compreso fra 300,000 e 700,000 anni
preferred label: Middle stage of Middle Pleistocene @en
notation: 1.1.3.1
in scheme: Vocabolario delle Età quaternarie
bibliographic citation: Definition provided by ITHACA Working Group - ISPRA 2024.
bibliographic citation: IUGS /CGI value
broader: Pleistocene medio (125,000-700,000)

Parte bassa del Pleistocene medio
type: Concept
definition: Time interval between the upper limit of the Early Pleistocene, i.e. 700ky and 1 Ma @en
definition: Intervallo temporale della parte bassa del Pleistocene Medio, esempio 700 mila e 1 milione di anni
preferred label: Lower stage of Middle Pleistocene @en
notation: 1.1.4
in scheme: Vocabolario delle Età quaternarie
bibliographic citation: Definition provided by ITHACA Working Group - ISPRA 2024.
bibliographic citation: IUGS /CGI value
broader: Pleistocene

Pleistocene inferiore
type: Concept
definition: Early Pleistocene (older bound- 2.588 Ma, younger bound-0.781 Ma) @en
definition: Pleistocene Inferiore (limite più antico-2.588 Ma, limite più recente 0.781 Ma)
preferred label: Early Pleistocene @en
notation: 1.1.5
in scheme: Vocabolario delle Età quaternarie
bibliographic citation: Definition provided by ITHACA Working Group - ISPRA 2024.
bibliographic citation: IUGS /CGI value
broader: Pleistocene
narrower: Intervallo temporale 1 del Pleistocene inferiore

Intervallo temporale 1 del Pleistocene inferiore
type: Concept
definition: Early Pleistocene time span between 1 Ma and 1,86 Ma @en
definition: Intervallo cronologico del Pleistocene Inferiore compreso fra 1,000,000 e 1,860,000 anni
preferred label: Calabrian @en
alternative label: Calabriano
notation: 1.1.5.1
in scheme: Vocabolario delle Età quaternarie
bibliographic citation: Definition provided by ITHACA Working Group - ISPRA 2024.
bibliographic citation: IUGS /CGI value
broader: Pleistocene inferiore

Ultimo glaciale
type: Concept
definition: Latest glacial (older bound-0.015 Ma, younger bound-0.009 Ma) @en
definition: Ultimo glaciale (limite più antico-0.015Ma, limite più giovane-0.009 Ma)
preferred label: Last glacial @en
notation: 1.2
in scheme: Vocabolario delle Età quaternarie
bibliographic citation: Definition provided by ITHACA Working Group - ISPRA 2024.
bibliographic citation: IUGS /CGI value
broader: Quaternario

Olocene
type: Concept
definition: Holocene (older bound-0.0117 Ma, younger bound-0.0 Ma) @en
definition: Olocene (limite più antico-0,0117 Ma, limite più giovane-0,0 Ma)
preferred label: Holocene @en
notation: 1.3
in scheme: Vocabolario delle Età quaternarie
bibliographic citation: Cohen, K.M., Finney, S.M., Gibbard, P.L., Fan, J.-X., 2013. The ICS International Chronostratigraphic Chart. Episodes 36, 199-204. www.episodes.org
broader: Quaternario
narrower: Età storica
narrower: Era preistorica neolitica

Età storica
type: Concept
definition: Historical (older bound-0,003 MA, younger bound-0,0 MA) @en
definition: Età storica (older bound-0.003 MA, younger bound-0,0 MA)
preferred label: Historical age @en
notation: 1.3.1
in scheme: Vocabolario delle Età quaternarie
bibliographic citation: Definition provided by ITHACA Working Group - ISPRA 2024.
bibliographic citation: IUGS /CGI value
broader: Olocene

Era preistorica neolitica
type: Concept
definition: Prehistory-Neolithic (older bound-0,009 MA, younger bound-0,003 MA) @en
definition: Preistorico-Neolitico (limite più antico-0,009 MA, limite più giovane-0,003 MA)
preferred label: Prehistoric-neolithic era @en
notation: 1.3.2
in scheme: Vocabolario delle Età quaternarie
bibliographic citation: Definition provided by ITHACA Working Group - ISPRA 2024.
bibliographic citation: IUGS /CGI value
broader: Olocene

Non definito
type: Concept
definition: Not defined time span @en
definition: Intervallo cronologico non definito
preferred label: Not defined @en
notation: 2
top concept of: Vocabolario delle Età quaternarie
in scheme: Vocabolario delle Età quaternarie
bibliographic citation: Definition provided by ITHACA Working Group - ISPRA 2024.