Vocabolario delle cinematiche della faglia
type: ConceptScheme
type: Dataset
type: Asset
title: Vocabulary of fault kinematics @en
description: Vocabulary of terms describing the fault kinematics @en
description: Vocabolario dei termini che descrivono la cinematica delle faglie
issued: 2024-07-03
modified: 2024-07-03
creator: ISPRA12
rights holder: Istituto Superiore per la Protezione e la Ricerca Ambientale
version info: 1.0
language: ITA
language: ENG
theme: ge
theme: nz
theme: ENV
keyword: geologia strutturale
keyword: GeoSciencesIR @en
keyword: tettonica
keyword: cartografia
keyword: Tectonics @en
accrual periodicity: IRREG
distribution: Distribuzione RDF/Turtle del vocabolario controllato GeoSciencesIR per la cinematica della faglia
type: Taxonomy
contact point: ISPRA12
number of levels: 2
conforms to: SKOS
representation technique: SKOS
creator: Anna Maria Blumetti (ORCID: 0000-0002-5331-9379)
creator: Pio Di Manna (ORCID: 0000-0003-3486-5136)
creator: Valerio Comerci (ORCID: 0000-0002-1022-9488)
creator: Deborah Maceroni
creator: Livio Bonadeo
creator: Giuseppe Castorina (ORCID: 0000-0003-1646-3010)
creator: Mariapia Congi (ORCID: 0000-0002-9330-9554)
creator: Carlo Cipolloni (ORCID: 0000-0001-7652-9814)
creator: Elio Giulianelli (ORCID: 0000-0003-0998-9751)
comment: standardizzazione dei termini e dei parametri utilizzati nelle codelist durante il processo di implementazione del Catalogo ITHACA, il database delle faglie capaci e dei siti paleosismologici
publisher: Istituto Superiore per la Protezione e la Ricerca Ambientale
key concept: kinematics
has top concept: Diretta
has top concept: Inversa
has top concept: Trascorrente
has top concept: Obliqua
has top concept: Non definito

Istituto Superiore per la Protezione e la Ricerca Ambientale
type: NamedIndividual
type: Agent
type: Organization
type: Organisation
name: Italian Institute for Environmental Protection and Research @en
fn: Italian Institute for Environmental Protection and Research

Distribuzione RDF/Turtle del vocabolario controllato GeoSciencesIR per la cinematica della faglia
type: Distribution
format: RDF TURTLE
license: A21 CCBY40
title: RDF/Turtle distribution of the controlled vocabulary within GeoSciencsIR for fault kinematics @en
description: Questa è la distribuzione RDF/Turtle del vocabolario controllato sviluppato nell'ambito di GeoSciencesIR per la cinematica della faglia
description: This is RDF/Turtle distribution of controlled vocabulary developed within GeoSciencesIR for the fault kinematics @en
access URL: https://github.com/isprambiente/dati-semantic/tree/main/assets/controlled-vocabularies/faults/kinematics
download URL: https://raw.githubusercontent.com/isprambiente/dati-semantic/main/assets/controlled-vocabularies/faults/kinematics/kinematics.ttl

ISPRA12
type: NamedIndividual
type: Organization
type: Kind
fn: Unità 12 del progetto GeoSciencesIR (Research Infrastructure)
fn: GeoSciencesIR (Research Infrastructure) project Unit 12 @en

Diretta
type: Concept
definition: Fault with dip-parallel displacement component of slip vector more than 10 times the strike-parallel component of the slip vector over more than half recognized extent of the fault, and for which the fault dips consistently in the same direction, and for which the hanging wall has been displaced down relative to the footwall. @en
definition: Faglia con componente dello spostamento parallela alla sua direzione di immersione superiore a 10 volte la componente di movimento parallela alla sua direzione, su più della metà dell'estensione riconosciuta della faglia, per la quale la faglia si immerge costantemente nella stessa direzione e per la quale il blocco di tetto è stato spostato verso il basso rispetto al blocco di letto.
preferred label: Normal fault @en
alternative label: Faglia normale
notation: 1
top concept of: Vocabolario delle cinematiche della faglia
in scheme: Vocabolario delle cinematiche della faglia
narrower: Normale obliqua sinistra
narrower: Normale obliqua destra

Normale obliqua sinistra
type: Concept
definition: Faglia ad alto angolo con vettore di slittamento che ha un rapporto tra spostamento strike-parallelo e dip-parallelo compreso tra 10 a 1 e 1 a 10 in almeno un punto lungo la traccia mappata, con componente strike-parallela sinistra e componente normale dip-parallela su almeno metà della traccia mappata della faglia.
definition: High angle fault with slip vector that has ratio of strike-parallel to dip-parallel displacement between 10 to 1 and 1 to 10 at at least one location along the mapped trace, with left-lateral strike-parallel component and normal dip-parallel component over at least half the mapped trace of the fault. @en
preferred label: Normal left oblique fault @en
alternative label: Faglia normale obliqua sinistra
notation: 1.1
in scheme: Vocabolario delle cinematiche della faglia
broader: Diretta

Normale obliqua destra
type: Concept
definition: High angle fault with slip vector that has ratio of strike-parallel to dip-parallel displacement between 10 to 1 and 1 to 10 at at least one location along the mapped trace, with right-lateral strike-parallel component and normal dip-parallel component of slip over at least half the mapped trace of the fault @en
definition: Faglia ad alto angolo con vettore di slittamento che ha un rapporto tra lo spostamento in direzione parallela all'asse e quello in direzione opposta compreso tra 10 a 1 e 1 a 10 in almeno un punto lungo la traccia mappata, con una componente parallela all'asse e una componente normale in direzione opposta allo slittamento su almeno metà della traccia mappata della faglia.
preferred label: Normal right oblique fault @en
alternative label: Faglia normale obliqua destra
notation: 1.2
in scheme: Vocabolario delle cinematiche della faglia
broader: Diretta

Inversa
type: Concept
definition: The hanging wall appears to have moved down relative to the footwall, dip of fault usually greater than 45 degrees. @en
definition: La parete pensile sembra essersi spostata verso il basso rispetto alla parete inferiore, con un'inclinazione della faglia solitamente superiore a 45 gradi.
preferred label: Reverse fault @en
alternative label: Faglia inversa
notation: 2
top concept of: Vocabolario delle cinematiche della faglia
in scheme: Vocabolario delle cinematiche della faglia
narrower: Inversa obliqua sinistra
narrower: Inversa obliqua destra

Inversa obliqua sinistra
type: Concept
definition: High angle fault with slip vector that has ratio of strike-parallel to dip-parallel displacement between 10 to 1 and 1 to 10 at at least one location along the mapped trace, with left-lateral strike-parallel component and reverse dip-parallel component over at least half the mapped trace of the fault. @en
definition: Faglia ad alto angolo con vettore di slittamento che ha un rapporto tra spostamento strike-parallelo e dip-parallelo compreso tra 10 a 1 e 1 a 10 in almeno un punto lungo la traccia mappata, con componente strike-parallelo laterale sinistra e componente dip-parallelo inversa su almeno metà della traccia mappata della faglia.
preferred label: Reverse left oblique fault @en
alternative label: Faglia inversa obliqua sinistra
notation: 2.1
in scheme: Vocabolario delle cinematiche della faglia
broader: Inversa

Inversa obliqua destra
type: Concept
definition: High angle fault with slip vector that has ratio of strike-parallel to dip-parallel displacement between 10 to 1 and 1 to 10 at at least one location along the mapped trace, with a right-lateral strike-parallel component and reverse dip-parallel component of slip over at least half the mapped trace of the fault. @en
definition: Faglia ad alto angolo con vettore di slittamento che ha un rapporto tra spostamento strike-parallelo e dip-parallelo compreso tra 10 a 1 e 1 a 10 in almeno un punto lungo la traccia mappata, con una componente strike-parallela laterale destra e una componente dip-parallela inversa dello slittamento su almeno metà della traccia mappata della faglia.
preferred label: Reverse right oblique fault @en
alternative label: Faglia inversa obliqua destra
notation: 2.2
in scheme: Vocabolario delle cinematiche della faglia
broader: Inversa

Trascorrente
type: Concept
definition: Fault with strike-parallel displacement component of slip vector more than 10 times the dip-parallel component of the slip vector at at least one location along the mapped trace of the fault. @en
definition: Faglia con componente di spostamento strike-parallelo del vettore di slittamento superiore a 10 volte la componente dip-parallela del vettore di slittamento in almeno un punto lungo la traccia mappata della faglia.
preferred label: Strike slip fault @en
alternative label: faglia_trascorrente
notation: 3
top concept of: Vocabolario delle cinematiche della faglia
in scheme: Vocabolario delle cinematiche della faglia
narrower: Trascorrente sinistra
narrower: Trascorrente destra

Trascorrente sinistra
type: Concept
definition: Fault with left-lateral strike-parallel displacement component of slip vector more than 10 times the dip-parallel component of the slip vector at at least one location along the fault, and left-lateral displacement over more than half the mapped trace of the fault. @en
definition: Faglia con componente di spostamento laterale sinistro del vettore di slittamento superiore a 10 volte la componente dip-parallela del vettore di slittamento in almeno un punto della faglia e spostamento laterale sinistro su più della metà della traccia mappata della faglia.
preferred label: Left strike slip fault @en
alternative label: Faglia trascorrente sinistra
notation: 3.1
in scheme: Vocabolario delle cinematiche della faglia
broader: Trascorrente

Trascorrente destra
type: Concept
definition: Fault with right-lateral strike-parallel displacement component of slip vector more than 10 times the dip-parallel component of the slip vector at at least one location along the fault, and right-lateral displacement over more than half the mapped trace of the fault. @en
definition: Faglia con componente di spostamento destro-parallelo del vettore di slittamento superiore a 10 volte la componente dip-parallelo del vettore di slittamento in almeno un punto della faglia e spostamento destro-parallelo su più della metà della traccia mappata della faglia
preferred label: Right strike slip fault @en
alternative label: Faglia trascorrente destra
notation: 3.2
in scheme: Vocabolario delle cinematiche della faglia
broader: Trascorrente

Obliqua
type: Concept
definition: Fault with slip vector that has ratio of strike-parallel to dip-parallel displacement between 10 to 1 and 1 to 10 at at least one location along the mapped trace of the fault. @en
definition: Faglia con vettore di slittamento che ha un rapporto tra spostamento strike-parallelo e dip-parallelo compreso tra 10 a 1 e 1 a 10 in almeno un punto lungo la traccia mappata della faglia.
preferred label: Oblique fault @en
alternative label: Faglia obliqua
notation: 4
top concept of: Vocabolario delle cinematiche della faglia
in scheme: Vocabolario delle cinematiche della faglia
narrower: Obliqua inversa sinistra
narrower: Faglia obliqua inversa destra
narrower: Faglia obliqua normale sinistra
narrower: Faglia obliqua normale destra

Obliqua inversa sinistra
type: Concept
definition: The movement sense includes both reverse and sinistral components, with a greater component of left lateral movement @en
definition: Il senso del movimento comprende sia componenti inverse che sinistrali, con una maggiore componente di movimento laterale sinistro.
preferred label: Oblique reverse left fault @en
alternative label: Faglia inversa obliqua sinistra
notation: 4.1
in scheme: Vocabolario delle cinematiche della faglia
bibliographic citation: Definition provided by ITHACA Working Group - ISPRA 2024.
broader: Obliqua

Faglia obliqua inversa destra
type: Concept
definition: The movement sense includes both reverse and sinistral components, with a greater component of right lateral movement @en
definition: Il senso del movimento comprende sia componenti inverse che sinistrali, con una maggiore componente di movimento laterale destro.
preferred label: Oblique reverse right fault @en
alternative label: Faglia inversa obliqua destra
notation: 4.2
in scheme: Vocabolario delle cinematiche della faglia
bibliographic citation: Definition provided by ITHACA Working Group - ISPRA 2024.
broader: Obliqua

Faglia obliqua normale sinistra
type: Concept
definition: The movement sense includes both normal and sinistral components, with a greater component of left lateral movement @en
definition: Il senso del movimento comprende sia componenti normali che sinistrali, con una maggiore componente di movimento laterale sinistro.
preferred label: Oblique normal left fault @en
alternative label: faglia normale obliqua sinistra
notation: 4.3
in scheme: Vocabolario delle cinematiche della faglia
bibliographic citation: Definition provided by ITHACA Working Group - ISPRA 2024.
broader: Obliqua

Faglia obliqua normale destra
type: Concept
definition: The movement sense includes both normal and sinistral components, with a greater component of right lateral movement @en
definition: Il senso del movimento comprende sia componenti normali che sinistrali, con una maggiore componente di movimento laterale destro.
preferred label: Oblique normal right fault @en
alternative label: Faglia normale obliqua destra
notation: 4.4
in scheme: Vocabolario delle cinematiche della faglia
bibliographic citation: Definition provided by ITHACA Working Group - ISPRA 2024.
broader: Obliqua

Non definito
type: Concept
definition: The movement sense is not defined @en
definition: Il senso di movimento non è definito
preferred label: Not defined @en
alternative label: Faglia con cinematica non definita
notation: 5
top concept of: Vocabolario delle cinematiche della faglia
in scheme: Vocabolario delle cinematiche della faglia
bibliographic citation: Definition provided by ITHACA Working Group - ISPRA 2024.