Vocabolario dei ranghi della faglia.
type: ConceptScheme
type: Dataset
type: Asset
title: Vocabulary of fault ranks. @en
description: Terms describing the hierarchization (rank) of faults. @en
description: Termini che descrivono la gerarchizzazione (rango) delle faglie.
issued: 2024-05-29
modified: 2024-05-29
creator: ISPRA12
rights holder: Istituto Superiore per la Protezione e la Ricerca Ambientale
version info: 1.0
language: ITA
language: ENG
theme: ge
theme: nz
keyword: Geologia strutturale
keyword: GeoSciencesIR @en
keyword: Tettonica
keyword: Cartografia
keyword: Geologia
keyword: Tectonics @en
keyword: Ranks @en
accrual periodicity: IRREG
distribution: Distribuzione RDF/Turtle del vocabolario controllato GeoSciencesIR per il rago della faglia
type: CodeList
contact point: ISPRA12
number of levels: 1
key concept: faultRanks
conforms to: SKOS
representation technique: SKOS
creator: Anna Maria Blumetti (ORCID: 0000-0002-5331-9379)
creator: Pio Di Manna (ORCID: 0000-0003-3486-5136)
creator: Valerio Comerci (ORCID: 0000-0002-1022-9488)
creator: Deborah Maceroni
creator: Livio Bonadeo
creator: Giuseppe Castorina (ORCID: 0000-0003-1646-3010)
creator: Mariapia Congi (ORCID: 0000-0002-9330-9554)
creator: Carlo Cipolloni (ORCID: 0000-0001-7652-9814)
creator: Elio Giulianelli (ORCID: 0000-0003-0998-9751)
comment: Standardizzazione dei termini e dei parametri utilizzati nelle codelist durante il processo di implementazione del database delle faglie capaci e dei siti paleosismologici
comment: Standardization of terms and parameters used in codelists during the implementation process of the ITHACA Catalogue, the database of capable faults and paleoseismological sites. @en
publisher: Istituto Superiore per la Protezione e la Ricerca Ambientale
has top concept: Faglia primaria
has top concept: Faglia secondaria

Istituto Superiore per la Protezione e la Ricerca Ambientale
type: NamedIndividual
type: Agent
type: Organization
type: Organisation
fn: Istituto Superiore per la Protezione e la Ricerca Ambientale

Distribuzione RDF/Turtle del vocabolario controllato GeoSciencesIR per il rago della faglia
type: Distribution
format: RDF TURTLE
license: A21 CCBY40
title: RDF/Turtle distribution of the controlled vocabulary within GeoSciencsIR for rank faults @en
description: Questa è la distribuzione RDF/Turtle del vocabolario controllato sviluppato nell'ambito di GeoSciencesIR per il rango delle faglie
description: This is RDF/Turtle distribution of controlled vocabulary developed within GeoSciencesIR for the rank faults @en
access URL: https://github.com/isprambiente/dati-semantic/tree/main/assets/controlled-vocabularies/faults/faultRanks
download URL: https://raw.githubusercontent.com/isprambiente/dati-semantic/main/assets/controlled-vocabularies/faults/faultRanksfaultRanks.ttl

ISPRA12
type: NamedIndividual
type: Organization
type: Kind
fn: Unità 12 del progetto GeoSciencesIR (Research Infrastructure)
fn: GeoSciencesIR (Research Infrastructure) project Unit 12 @en

Faglia primaria
type: Concept
definition: Fault that generally represents the surface expression of a seismogenic source along which greater rupture lengths and displacements are expected. In plan, it represents the surface emergence of the deep main fault plane; it may be composed of a single trace, but more often of a series of directly interconnected segments, which tend to rupture at the same time or at short intervals. In many cases, but not necessarily, it corresponds to the tectonic structure that controls recent geomorphological evolution in the area of interest. A primary capable fault is characterised by greater morphological evidence within a geological-structural system, on which aseismic movements may also occur. @en
definition: Faglia che generalmente rappresenta l'espressione superficiale di una sorgente sismogenetica lungo la quale si prevedono lunghezze di rottura e spostamenti maggiori. In pianta, rappresenta l'emergenza superficiale del piano di faglia principale profondo; può essere composta da un'unica traccia, ma più spesso da una serie di segmenti direttamente interconnessi, che tendono a rompersi contemporaneamente o a brevi intervalli. In molti casi, ma non necessariamente, corrisponde alla struttura tettonica che controlla l'evoluzione geomorfologica recente nell'area di interesse. Una faglia capace primaria è caratterizzata da una maggiore evidenza morfologica all'interno di un sistema geologico-strutturale, sul quale possono verificarsi anche movimenti asismici.
preferred label: Primary fault @en
alternative label: Faglia di rango primario
notation: 1.0
top concept of: Vocabolario dei ranghi della faglia.
in scheme: Vocabolario dei ranghi della faglia.
bibliographic citation: Definition provided by ITHACA Working Group - ISPRA 2024.

Faglia secondaria
type: Concept
definition: Fault whose activity depends on the movements of the primary fault. That is, it is structurally connected to the primary fault, on the surface and/or in depth, i.e. as a synthetic or antithetic splay, but it cannot be expected to be reactivated independently of the primary fault system in the area of interest. In the case of coseismic reactivation, it has generally smaller ruptures than the primary fault. @en
definition: Faglia la cui attività dipende dai movimenti della faglia primaria. Cioè, è strutturalmente connessa alla faglia primaria, in superficie e/o in profondità, cioè come splay sintetico o antitetico, ma non ci si può aspettare che si riattivi indipendentemente dal sistema di faglie primarie nell'area di interesse. In caso di riattivazione coseismica, presenta in genere rotture più piccole rispetto alla faglia primaria.
preferred label: Secondary fault @en
alternative label: Faglia di rango secondario
notation: 2.0
top concept of: Vocabolario dei ranghi della faglia.
in scheme: Vocabolario dei ranghi della faglia.
bibliographic citation: Definition provided by ITHACA Working Group - ISPRA 2024.