Vocabolario degli effetti in superficie sull'acqua.
type: ConceptScheme
type: Dataset
type: Asset
title: Vocabulary of surface effects on water. @en
description: This vocabulary describes the hierarchical classification of Earthquake Environmental Effects (EEEs) documented after a seismic event and eventually categorized using the Environmental Seismic Intensity (ESI) scale. @en
description: Questo vocabolario descrive la classificazione gerarchica degli effetti ambientali dei terremoti (EEE) documentati dopo un evento sismico ed eventualmente classificati utilizzando la scala di intensità sismica ambientale (ESI).
issued: 2024-10-01
modified: 2024-10-01
creator: IN03-Un
rights holder: Istituto Superiore per la Protezione e la Ricerca Ambientale
version info: 1.0
language: ITA
language: ENG
theme: ge
theme: nz
keyword: Geologia ambientale
keyword: GeoSciencesIR @en
keyword: Rischio geologico
keyword: Environmental geology @en
keyword: Geological risk @en
accrual periodicity: IRREG
distribution: eee-surfaceWaterEffects-RDF-TURTLE
type: CodeList
contact point: IN03-Un
number of levels: 1
key concept: surfaceWaterEffects
conforms to: SKOS
representation technique: SKOS
creator: Alessandro Maria Michetti (ORCID: 0000-0002-1775-1340)
creator: Luca Guerrieri (ORCID: 0000-0002-2513-3198)
creator: Paolo Lino Manganello (ORCID: 0009-0008-5129-4391)
creator: Maria Pia Congi (ORCID: 0000-0002-9330-9554)
creator: Carlo Cipolloni (ORCID: 0000-0001-7652-9814)
creator: Elio Giulianelli (ORCID: 0000-0003-0998-9751)
comment: Il vocabolario è stato elaborato dalla task 4.3a (INSUBRIA 03) del progetto GeoSciencesIR al fine di armonizzare i termini del database EEE catalogue.
comment: The vocabulary was developed by Task 4.3a (INSUBRIA 03) of the GeoSciencesIR project in order to harmonize the terms of the EEE Catalogue database. @en
publisher: Istituto Superiore per la Protezione e la Ricerca Ambientale
has top concept: Straripamento
has top concept: onda
has top concept: fontana d'acqua
has top concept: variazione di portata
has top concept: torbidità del fiume
has top concept: altro
has top concept: variazione di temperatura
has top concept: Variazione chimica
has top concept: sbarramento e formazione di un lago
has top concept: Sag pond - Stagno di sprofondamento
has top concept: variazione livello dell'acqua
has top concept: scomparsa del flusso
has top concept: Torbidità della sorgente

Istituto Superiore per la Protezione e la Ricerca Ambientale
type: NamedIndividual
type: Agent
type: Organization
type: Organosation
fn: Istituto Superiore per la Protezione e la Ricerca Ambientale

Distribuzione RDF/Turtle del vocabolario controllato GeoSciencesIR per gli effetti superficiali relativi alle acque.
type: Distribution
format: RDF TURTLE
license: A21 CCBY40
title: RDF/Turtle distribution of the GeoSciencesIR controlled vocabulary for water-related surface effects. @en
description: Questa è la Distribuzione RDF/Turtle del vocabolario controllato GeoSciencesIR per gli effetti superficiali relativi alle acque.
description: This is the RDF/Turtle distribution of the GeoSciencesIR controlled vocabulary for water-related surface effects. @en
access URL: https://github.com/isprambiente/dati-semantic/tree/main/assets/controlled-vocabularies/eee/surfaceWaterEffects
download URL: https://raw.githubusercontent.com/isprambiente/dati-semantic/main/assets/controlled-vocabularies/eee/surfaceWaterEffects/surfaceWaterEffects.ttl

IN03-Un
type: NamedIndividual
type: Organization
type: Kind
fn: Unità INSUBRIA 03 del progetto GeoSciencesIR (Research Infrastructure)
fn: GeoSciencesIR (Research Infrastructure) project Unit INSUBRIA 03 @en

Straripamento
type: Concept
definition: Increase in the amount of water held in a surface water body, exceeding the volume capacity @en
definition: Aumento della quantità di acqua ospitata in un corpo idrico superficiale, fino al superamento della capacità volumetrica
preferred label: Overflow @en
notation: 1
top concept of: Vocabolario degli effetti in superficie sull'acqua.
in scheme: Vocabolario degli effetti in superficie sull'acqua.

onda
type: Concept
definition: Anomalous waves in surface water bodies @en
definition: Onde anomale in corpi d'acqua superficiale
preferred label: Wave @en
notation: 2
top concept of: Vocabolario degli effetti in superficie sull'acqua.
in scheme: Vocabolario degli effetti in superficie sull'acqua.

fontana d'acqua
type: Concept
definition: Increase in the amount of water held in a surface water body, which generates water spurts @en
definition: Aumento della quantità di acqua ospitata in un corpo idrico superficiale, che genera zampilli d'acqua
preferred label: Water fountain @en
notation: 3
top concept of: Vocabolario degli effetti in superficie sull'acqua.
in scheme: Vocabolario degli effetti in superficie sull'acqua.

variazione di portata
type: Concept
definition: Variation in the rate of water flow in the river @en
definition: Variazione nella portata di defusso dell'acqua in un fiume
preferred label: Discharge variation @en
notation: 4
top concept of: Vocabolario degli effetti in superficie sull'acqua.
in scheme: Vocabolario degli effetti in superficie sull'acqua.

torbidità del fiume
type: Concept
definition: Turbidity is a measure of water clarity. An increase in turbidity following earthquakes could be due to the remobilization of suspended solids @en
definition: La torbidità è una misura della limpidezza dell'acqua. Un aumento della torbidità in seguito a terremoti può essere legato alla rimobilizzazione dei solidi sospesi
preferred label: Turbidity of river @en
notation: 5
top concept of: Vocabolario degli effetti in superficie sull'acqua.
in scheme: Vocabolario degli effetti in superficie sull'acqua.

altro
type: Concept
definition: Other effects on surface water @en
definition: Altri effetti sulle acque superficiali
preferred label: Other @en
notation: 6
top concept of: Vocabolario degli effetti in superficie sull'acqua.
in scheme: Vocabolario degli effetti in superficie sull'acqua.

variazione di temperatura
type: Concept
definition: Changing in temperature of water @en
definition: Cambiamento nella temperatura dell'acqua
preferred label: Change of temperature @en
notation: 7
top concept of: Vocabolario degli effetti in superficie sull'acqua.
in scheme: Vocabolario degli effetti in superficie sull'acqua.

Variazione chimica
type: Concept
definition: Changes in the chemical composition of spring/river/lake water @en
definition: Cambimento nella composizione chimica delle acque
preferred label: Chemical variation @en
notation: 8
top concept of: Vocabolario degli effetti in superficie sull'acqua.
in scheme: Vocabolario degli effetti in superficie sull'acqua.

sbarramento e formazione di un lago
type: Concept
definition: Formation of a temporary lake due to water course blockage @en
definition: Formazione di un lago temporaneo per sbarramento di un corso d'acqua
preferred label: Lake Dammed @en
notation: 9
top concept of: Vocabolario degli effetti in superficie sull'acqua.
in scheme: Vocabolario degli effetti in superficie sull'acqua.

Sag pond - Stagno di sprofondamento
type: Concept
definition: An elongated depression, typically a few tens of metres across and a few hundred metres long, that forms due to compressional or extensional stresses along a strike-slip fault @en
definition: Una depressione allungata, in genere larga poche decine di metri e lunga poche centinaia di metri, che si forma a causa di sollecitazioni compressive o estensionali lungo una faglia trascorrente
preferred label: SagPond @en
notation: 10
top concept of: Vocabolario degli effetti in superficie sull'acqua.
in scheme: Vocabolario degli effetti in superficie sull'acqua.

variazione livello dell'acqua
type: Concept
definition: Change in the water level of a surface water body, in concomitance with the occurrence of a seismic event @en
definition: Variazione nel livello dell'acqua di un corpo idrico superficiale in corrispondenza del verificarsi di un terremoto
preferred label: Water level changes @en
notation: 11
top concept of: Vocabolario degli effetti in superficie sull'acqua.
in scheme: Vocabolario degli effetti in superficie sull'acqua.

scomparsa del flusso
type: Concept
definition: Disappearance of the water flow in the river @en
definition: Scomparsa del flusso d'acqua in un fiume
preferred label: Disappear of flow @en
notation: 12
top concept of: Vocabolario degli effetti in superficie sull'acqua.
in scheme: Vocabolario degli effetti in superficie sull'acqua.

Torbidità della sorgente
type: Concept
definition: Turbidity is a measure of water clarity. An increase in turbidity following earthquakes could be due to the remobilization of suspended solids @en
definition: La torbidità è una misura della limpidezza dell'acqua. Un aumento della torbidità in seguito a terremoti può essere legato alla rimobilizzazione dei solidi sospesi
preferred label: Turbidity of spring @en
notation: 13
top concept of: Vocabolario degli effetti in superficie sull'acqua.
in scheme: Vocabolario degli effetti in superficie sull'acqua.