Vocabolario di altri elementi degli effetti di terremoto.
type: ConceptScheme
type: Dataset
type: Asset
title: Vocabulary of other elements of earthquake effects. @en
description: The terms describe other elements characterizing the environmental effects of the earthquake. @en
description: I termini descrivono altri elementi caratterizzati gli effetti ambientali del terremoto.
issued: 2024-10-01
modified: 2024-10-01
creator: IN03-Un
rights holder: Istituto Superiore per la Protezione e la Ricerca Ambientale
version info: 1.0
language: ITA
language: ENG
theme: ge
theme: nz
keyword: Geologia ambientale
keyword: GeoSciencesIR @en
keyword: Rischio geologico
keyword: Environmental geology @en
accrual periodicity: IRREG
distribution: eee-otherEffects-RDF-TURTLE
type: CodeList
contact point: IN03-Un
number of levels: 1
key concept: otherFeatures
conforms to: SKOS
representation technique: SKOS
creator: Alessandro Maria Michetti (ORCID: 0000-0002-1775-1340)
creator: Luca Guerrieri (ORCID: 0000-0002-2513-3198)
creator: Paolo Lino Manganello (ORCID: 0009-0008-5129-4391)
creator: Maria Pia Congi (ORCID: 0000-0002-9330-9554)
creator: Carlo Cipolloni (ORCID: 0000-0001-7652-9814)
creator: Elio Giulianelli (ORCID: 0000-0003-0998-9751)
comment: Il vocabolario è stato elaborato dalla task 4.3a (INSUBRIA 03) del progetto GeoSciencesIR al fine di armonizzare i termini del database EEE catalogue.
comment: The vocabulary was developed by Task 4.3a (INSUBRIA 03) of the GeoSciencesIR project in order to harmonize the terms of the EEE Catalogue database. @en
publisher: Istituto Superiore per la Protezione e la Ricerca Ambientale
has top concept: Struttura a graben per gravità
has top concept: Struttura a push up
has top concept: Struttura a pull-apart
has top concept: Traccia di deformazione
has top concept: Struttura a graben

Istituto Superiore per la Protezione e la Ricerca Ambientale
type: NamedIndividual
type: Agent
type: Organization
type: Organisation
fn: Istituto Superiore per la Protezione e la Ricerca Ambientale

Distribuzione RDF/Turtle del vocabolario controllato GeoSciencesIR per gli altri elementi caratterizzati gli effetti ambientali.
type: Distribution
format: RDF TURTLE
license: A21 CCBY40
title: RDF/Turtle distribution of the GeoSciencesIR controlled vocabulary for the other elements characterized the environmental effects. @en
description: Questa è la Distribuzione RDF/Turtle del vocabolario controllato GeoSciencesIR per gli altri elementi caratterizzati gli effetti ambientali.
description: This is the RDF/Turtle distribution of the GeoSciencesIR controlled vocabulary for the other elements characterized the environmental effects. @en
access URL: https://github.com/isprambiente/dati-semantic/tree/main/assets/controlled-vocabularies/eee/otherFeatures
download URL: https://raw.githubusercontent.com/isprambiente/dati-semantic/main/assets/controlled-vocabularies/eee/otherFeatures/otherFeatures.ttl

IN03-Un
type: NamedIndividual
type: Organization
type: Kind
fn: Unità INSUBRIA 03 del progetto GeoSciencesIR (Research Infrastructure)
fn: GeoSciencesIR (Research Infrastructure) project Unit INSUBRIA 03 @en

Struttura a graben per gravità
type: Concept
definition: narrow, discontinuous graben or grouped longitudinal fault structures, originated under the direct influence of gravity rather than tectonic forces @en
definition: deformazioni strette e discontinue o raggruppate, originate sotto l'influenza diretta della gravità piuttosto che delle forze tettoniche
preferred label: Gravity graben structure @en
notation: 1
top concept of: Vocabolario di altri elementi degli effetti di terremoto.
in scheme: Vocabolario di altri elementi degli effetti di terremoto.
bibliographic citation: Slemmons, D. B. (1957). Geological effects of the Dixie valley-Fairview peak, Nevada, earthquakes of December 16, 1954. Bulletin of the Seismological Society of America, 47(4), 353-375.

Struttura a push up
type: Concept
definition: Push-up structures, also known as 'positive flower' or 'palm tree' structures, are well-established transpressional uplifts of intra-plate wrench or strike-slip tectonics that occur within restraining bends or stepovers @en
definition: Le strutture push-up, note anche come strutture a "fiore positivo" o a "palma", sono sollevamenti transpressivi in zone intra-placca o strike-slip che si verificano all'interno di restraining bend o stepover
preferred label: Push ups structure @en
notation: 2
top concept of: Vocabolario di altri elementi degli effetti di terremoto.
in scheme: Vocabolario di altri elementi degli effetti di terremoto.
bibliographic citation: McClay, K., & Bonora, M. (2001). Analog models of restraining stepovers in strike-slip fault systems. AAPG bulletin, 85(2), 233-260.

Struttura a pull-apart
type: Concept
definition: A pull-apart basin is a structural basin where two overlapping (en echelon) strike-slip faults or a fault bend create an area of crustal extension undergoing tension, which causes the basin to sink down @en
definition: Un bacino pull-apart è un bacino strutturale in cui due faglie trascorrenti sovrapposte (en echelon) o una variazione di direzione della faglia creano un'area di estensione crostale sottoposta a tensione, che provoca lo sprofondamento del bacino
preferred label: Pull apart structure @en
notation: 3
top concept of: Vocabolario di altri elementi degli effetti di terremoto.
in scheme: Vocabolario di altri elementi degli effetti di terremoto.

Traccia di deformazione
type: Concept
definition: Deformed and upheaved ground occurring generally along strike-slip ruptures @en
definition: Deformazione e sollevamento del terreno che si verifica generalmente in corrispondenza di fagliazione legata a terremoti per faglie strike-slip
preferred label: Mole track strucutre @en
notation: 4
top concept of: Vocabolario di altri elementi degli effetti di terremoto.
in scheme: Vocabolario di altri elementi degli effetti di terremoto.

Struttura a graben
type: Concept
definition: strike-slip ruptures @en
definition: Una depressione o bacino allungato, delimitato su entrambi i lati da faglie normali ad alto angolo che si abbassano l'una verso l'altra. È una forma strutturale che può o meno essere espressa geomorfologicamente come una fossa tettonica
preferred label: Graben structure @en
notation: 5
top concept of: Vocabolario di altri elementi degli effetti di terremoto.
in scheme: Vocabolario di altri elementi degli effetti di terremoto.