Vocabolario dell'origine delle fratture a terra.
type: ConceptScheme
type: Dataset
type: Asset
title: Vocabulary of the origin of ground fractures. @en
description: The term define the feature responsible for the generation of the observed ground crack @en
description: I termini descrivono il processo responsabile della generazione della frattura cosismica osservata.
issued: 2024-10-01
modified: 2024-10-01
creator: IN03-Un
creator: ISPRA12
rights holder: Università degli Studi dell'Insubria
rights holder: Istituto Superiore per la Protezione e la Ricerca Ambientale
version info: 1.0
language: ITA
language: ENG
theme: ge
theme: nz
keyword: Geologia ambientale
keyword: GeoSciencesIR @en
keyword: Rischio geologico
keyword: Geologic risk @en
accrual periodicity: IRREG
distribution: eee-originGroundCracks-RDF-TURTLE
type: CodeList
contact point: IN03-Un
contact point: ISPRA12
number of levels: 1
key concept: originGroundCracks
conforms to: SKOS
representation technique: SKOS
creator: Alessandro Maria Michetti (ORCID: 0000-0002-1775-1340)
creator: Luca Guerrieri (ORCID: 0000-0002-2513-3198)
creator: Paolo Lino Manganello (ORCID: 0009-0008-5129-4391)
creator: Maria Pia Congi (ORCID: 0000-0002-9330-9554)
creator: Carlo Cipolloni (ORCID: 0000-0001-7652-9814)
creator: Elio Giulianelli (ORCID: 0000-0003-0998-9751)
comment: Il vocabolario è stato elaborato dalla task 4.3a (INSUBRIA 03) del progetto GeoSciencesIR al fine di armonizzare i termini del database EEE catalogue.
comment: The vocabulary was developed by Task 4.3a (INSUBRIA 03) of the GeoSciencesIR project in order to harmonize the terms of the EEE Catalogue database. @en
publisher: Università degli Studi dell'Insubria
publisher: Istituto Superiore per la Protezione e la Ricerca Ambientale
has top concept: Scivolamento
has top concept: Assestamento del terreno
has top concept: Distacco
has top concept: scuotimento

Università degli Studi dell'Insubria
type: NamedIndividual
type: Agent
type: Organization
type: Organisation
fn: Università degli Studi dell'Insubria

IN03-Un
type: NamedIndividual
type: Organization
type: Kind
fn: Unità INSUBRIA 03 del progetto GeoSciencesIR (Research Infrastructure)
fn: GeoSciencesIR (Research Infrastructure) project Unit INSUBRIA 03 @en

Istituto Superiore per la Protezione e la Ricerca Ambientale
type: NamedIndividual
type: Agent
type: Organization
type: Organisation
fn: Istituto Superiore per la Protezione e la Ricerca Ambientale

ISPRA12
type: NamedIndividual
type: Organization
type: Kind
fn: Unità ISPRA12 del progetto GeoSciencesIR (Research Infrastructure)
fn: GeoSciencesIR (Research Infrastructure) project Unit ISPRA12 @en

Distribuzione RDF/Turtle del vocabolario controllato GeoSciencesIR per gli effetti superficiali relativi alle acque.
type: Distribution
format: RDF TURTLE
license: A21 CCBY40
title: RDF/Turtle distribution of the GeoSciencesIR controlled vocabulary for water-related surface effects. @en
description: Questa è la Distribuzione RDF/Turtle del vocabolario controllato GeoSciencesIR per gli effetti superficiali relativi alle acque.
description: This is the RDF/Turtle distribution of the GeoSciencesIR controlled vocabulary for water-related surface effects. @en
access URL: https://github.com/isprambiente/dati-semantic/tree/main/assets/controlled-vocabularies/eee/originGroundCracks
download URL: https://raw.githubusercontent.com/isprambiente/dati-semantic/main/assets/controlled-vocabularies/eee/originGroundCracks/originGroundCracks.ttl

Scivolamento
type: Concept
definition: Rotational or traslational sliding of a volume of material along a slope, under the force of gravity @en
definition: Scivolamento rotazionale o traslativo di un volume di terreno o rocce lungo un pendio sotto la forza di gravità
preferred label: Slide @en
notation: 1
top concept of: Vocabolario dell'origine delle fratture a terra.
in scheme: Vocabolario dell'origine delle fratture a terra.

Assestamento del terreno
type: Concept
definition: mainly vertical downwards ground movement of the surface of the Earth @en
definition: Movimento del suolo principalmente verticale verso il basso della superficie terrestre
preferred label: Ground settling @en
notation: 2
top concept of: Vocabolario dell'origine delle fratture a terra.
in scheme: Vocabolario dell'origine delle fratture a terra.

Distacco
type: Concept
definition: Structural discontinuity responsible for the displacement of a rock mass from the leyars benath @en
definition: Discontinuità strutturale responsabile dello spostamento di un ammasso roccioso rispetto ai livelli sottostanti
preferred label: Detachment @en
notation: 3
top concept of: Vocabolario dell'origine delle fratture a terra.
in scheme: Vocabolario dell'origine delle fratture a terra.

scuotimento
type: Concept
definition: vibration of the ground due to the passage of seismic waves @en
definition: Vibrazione della superficie terrestre causata dal passaggio delle onde sismiche
preferred label: Ground shaking @en
notation: 4
top concept of: Vocabolario dell'origine delle fratture a terra.
in scheme: Vocabolario dell'origine delle fratture a terra.