Vocabolario degli effetti sull'assetto della geomorfologia del territorio.
type: ConceptScheme
type: Dataset
type: Asset
title: Vocabulary of the effects on the geomorphological structure of the landscape. @en
description: The terms in the following vocabulary are related to the classification of the effects on the geomorphological structure of the landscape. @en
description: I termini del seguente vocabolario sono relativi alla classificazione degli effetti sull'assetto geomorfologico del territorio.
issued: 2024-10-01
modified: 2024-10-01
creator: IN03-Un
rights holder: Istituto Superiore per la Protezione e la Ricerca Ambientale
version info: 1.0
language: ITA
language: ENG
theme: ge
theme: nz
keyword: Geologia ambientale
keyword: GeoSciencesIR @en
keyword: Rischio geologico
keyword: Environmnetal geology @en
accrual periodicity: IRREG
distribution: eee-geomorphSettings-RDF-TURTLE
type: CodeList
contact point: IN03-Un
number of levels: 1
key concept: geomorphSetting
conforms to: SKOS
representation technique: SKOS
creator: Alessandro Maria Michetti (ORCID: 0000-0002-1775-1340)
creator: Luca Guerrieri (ORCID: 0000-0002-2513-3198)
creator: Paolo Lino Manganello (ORCID: 0009-0008-5129-4391)
creator: Maria Pia Congi (ORCID: 0000-0002-9330-9554)
creator: Carlo Cipolloni (ORCID: 0000-0001-7652-9814)
creator: Elio Giulianelli (ORCID: 0000-0003-0998-9751)
comment: Il vocabolario è stato elaborato dalla task 4.3a (INSUBRIA 03) del progetto GeoSciencesIR al fine di armonizzare i termini del database EEE catalogue.
comment: The vocabulary was developed by Task 4.3a (INSUBRIA 03) of the GeoSciencesIR project in order to harmonize the terms of the EEE Catalogue database. @en
publisher: Istituto Superiore per la Protezione e la Ricerca Ambientale
has top concept: Versante montuoso
has top concept: Valle montana
has top concept: Versante collinare

Istituto Superiore per la Protezione e la Ricerca Ambientale
type: NamedIndividual
type: Agent
type: Organization
type: Organisation
fn: Istituto Superiore per la Protezione e la Ricerca Ambientale

IN03-Un
type: NamedIndividual
type: Organization
type: Kind
fn: Unità INSUBRIA 03 del progetto GeoSciencesIR (Research Infrastructure)
fn: GeoSciencesIR (Research Infrastructure) project Unit INSUBRIA 03 @en

Distribuzione RDF/Turtle del vocabolario controllato GeoSciencesIR per gli effetti sull'assetto geomorfologico.
type: Distribution
format: RDF TURTLE
license: A21 CCBY40
title: RDF/Turtle distribution of the GeoSciencesIR controlled vocabulary for the effects on the geomorphological structure. @en
description: Questa è la Distribuzione RDF/Turtle del vocabolario controllato GeoSciencesIR per gli effetti sull'assetto geomorfologico.
description: This is the RDF/Turtle distribution of the GeoSciencesIR controlled vocabulary for the effects on the geomorphological structure. @en
access URL: https://github.com/isprambiente/dati-semantic/tree/main/assets/controlled-vocabularies/eee/geomorphSetting
download URL: https://raw.githubusercontent.com/isprambiente/dati-semantic/main/assets/controlled-vocabularies/eee/geomorphSetting/geomorphSetting.ttl

Versante montuoso
type: Concept
definition: Geomorphological component of mountains characterized by complex back slopes that are very long with relatively steep gradients and composed of colluvial sediment mantles of varying heights, rocky outcrops, or structural ridges. @en
definition: Componente geomorfologica delle montagne caratterizzata da pendii posteriori complessi molto lunghi con gradienti di inclinazione relativamente elevati e composta da mantelli di sedimenti colluviali di varia altezza, affioramenti rocciosi o argini strutturali.
preferred label: Mountainous side @en
notation: 1
top concept of: Vocabolario degli effetti sull'assetto della geomorfologia del territorio.
in scheme: Vocabolario degli effetti sull'assetto della geomorfologia del territorio.
bibliographic citation: Archivio INSPIRE

Valle montana
type: Concept
definition: Geomorphological component of mountains consisting of a ramp or wedge that is very to slightly concave at the base of the mountain slopes. @en
definition: Componente geomorfologica delle montagne costituita da una rampa o un cuneo da molto a leggermente concavi al fondo dei pendii della montagna.
preferred label: Mountain valley @en
notation: 2
top concept of: Vocabolario degli effetti sull'assetto della geomorfologia del territorio.
in scheme: Vocabolario degli effetti sull'assetto della geomorfologia del territorio.
bibliographic citation: Archivio INSPIRE

Versante collinare
type: Concept
definition: Earth surface setting characterized by surface slope angles high enough that gravity alone becomes a significant factor in geomorphic development, as well as base-of-slope areas influenced by hillslope processes. Hillslope activities include creep, sliding, slumping, falling, and other downslope movements caused by slope collapse induced by gravitational influence on earth materials. May be subaerial or subaqueous. @en
definition: Impostazione della superficie terrestre caratterizzata da angoli di inclinazione sufficientemente elevati affinché la gravità diventi un fattore significativo nello sviluppo geomorfologico, così come le aree alla base della pendenza influenzate dai processi di pendio. Le attività di pendio includono il movimento lento (creep), lo scivolamento, il cedimento, la caduta e altri movimenti verso il basso causati dal collasso della pendenza indotto dall'influenza gravitazionale sui materiali terrestri. Possono essere subaerei o subacquei.
preferred label: Hilly slope @en
notation: 3
top concept of: Vocabolario degli effetti sull'assetto della geomorfologia del territorio.
in scheme: Vocabolario degli effetti sull'assetto della geomorfologia del territorio.
bibliographic citation: IUGS vocabulary